{"text_format":"1","workbook":"xlsx","n_sheets":7,"sheets":["Early Years Funding","DAF","3&4","Adj indicative","2 YO","EY PP","EYPP Pupils"],"not_rendered":{"charts":0,"images":1,"macros":1,"external_links":0,"defined_names":6,"comments":0,"pivot_tables":0},"unopened":[],"bounds":{"document_bytes":16777216,"sheet_cells":100000,"rows_first":2000,"rows_last":500,"rows_between":2000,"halvings":0,"cell_chars":16384,"cell_head_chars":4096},"cells_cut":0,"cells_raw":0,"read":"whole","date_system":"1900"}

{"sheet":"Early Years Funding","index":0,"n_rows":37,"n_cols":11,"rows_kept":37,"cut":false,"hidden":false,"merged":[[6,1,6,10],[8,9,8,10],[8,6,8,7],[8,0,8,1],[8,3,8,4]]}
[]
[]
[]
[]
["Early Years Funding - Summer Term Final 2018-19"]
[]
[null,{"$f":"+IF(A7=\"\",\"\",VLOOKUP(A7,'3&4'!A3:C76,3,FALSE))","v":""}]
[{"$f":"IF(A7=\"\",\"Please enter you 8 digit passcode in the blue box above\",\"\")","v":"Please enter you 8 digit passcode in the blue box above"}]
["3 & 4 Year Old Funding",null,null,"Disability Access Fund",null,null,"2 Year Old Funding",null,null,"Early Years Pupil Premium"]
[]
["Base Rate",4.33,null,"Annual Value",615,null,"Hourly Rate",{"$f":"+'2 YO'!H1","v":5.08},null,"Hourly Rate",{"$f":"+'EY PP'!F2","v":0.53}]
[]
["Estimated Funded Universal Hours",{"$f":"+IF(ISNA(VLOOKUP($A$7,'Adj indicative'!$A$5:$Q$80,9,FALSE)),0,(VLOOKUP($A$7,'Adj indicative'!$A$5:$Q$80,9,FALSE)))","v":0},null,null,null,null,"Weekly Funded Hours",{"$f":"+SUMIFS('2 YO'!$A$2:$A$49,'2 YO'!$D$2:$D$49,\"Y\",'2 YO'!$G$2:$G$49,A7)","v":0},null,"Weekly Funded Hours",{"$f":"+IF(ISNA(VLOOKUP(A7,'EY PP'!$B$5:$F$35,4,FALSE)),0,VLOOKUP(A7,'EY PP'!$B$5:$F$35,4,FALSE))","v":0}]
["Estimated Funded Extended Hours",{"$f":"+IF(ISNA(VLOOKUP($A$7,'Adj indicative'!$A$5:$Q$80,10,FALSE)),0,(VLOOKUP($A$7,'Adj indicative'!$A$5:$Q$80,10,FALSE)))","v":0}]
[]
["Total Estimated Base Rate Funding",{"$f":"SUM(B14+B13)*B11","v":0},null,"Number of children",{"$f":"+IF(ISNA(VLOOKUP($A$7,DAF!A$3:D$3,4,FALSE)),0,VLOOKUP($A$7,DAF!A$3:D$3,4,FALSE))","v":0},null,"Funded Weeks",12,null,"Funded Weeks",12]
["Estimated Deprivation Funding",{"$f":"+IF(ISNA(VLOOKUP($A$7,'Adj indicative'!A5:Q80,13,FALSE)),0,(VLOOKUP($A$7,'Adj indicative'!A5:Q80,13,FALSE)))+IF(ISNA(VLOOKUP($A$7,'Adj indicative'!A5:Q81,14,FALSE)),0,(VLOOKUP($A$7,'Adj indicative'!A5:Q80,14,FALSE)))","v":0}]
["Summer Term Indicative Funding",{"$f":"B16+B17","v":0}]
[]
["Actual Funded Universal Hours",{"$f":"+IF(ISNA(VLOOKUP($A$7,'3&4'!$A$2:$Q$76,5,FALSE)),0,VLOOKUP($A$7,'3&4'!$A$2:$Q$76,5,FALSE))*12","v":0}]
{"$rows_left_out":18}
{"sheet":"DAF","index":1,"n_rows":3,"n_cols":5,"rows_kept":3,"cut":false,"hidden":true,"merged":[]}
["DAF"]
[]
["3329yZe4",3329,"Robin Hood Primary School",4,615]

{"sheet":"3&4","index":2,"n_rows":78,"n_cols":17,"rows_kept":78,"cut":false,"hidden":true,"merged":[]}
[null,null,null,"Weeks",12]
["Passcode","DFE","School Name","Status","May Census Weekly Hours (funded hours)","May Census Extended (with code)","May Census Weekly Hours (Hours at setting)","Hours not funded","Summer Term Funded Hours","Deprivation","Base Rate","Summer Term Funding","Estimated Summer Term Funding (incl deprivation)","Variance actual v est","Maintained Schools Budget Share Adjustments","100% Academies Initial Autumn payment based on indicative (incl deprivation)","Academies Final Payment"]
["2045a%7K",2045,"Bentinck Primary and Nursery School","Null",630,105,765,30,8820,900,38190.6,39090.6,35207.446153846155,3883.1538461538439,3883,"NA","NA"]
["2006K8b8",2006,"Berridge Primary","Null",1245,0,1245,0,14940,1620,64690.200000000004,66310.200000000012,72243.331034482748,-5933.1310344827361,-5933,"NA","NA"]
["2056&z#7",2056,"Cantrell Primary and Nursery School","Null",825,375,1200,0,14400,1530,62352,63882,86742.747169811322,-22860.747169811322,-22861,"NA","NA"]
["2057JagM",2057,"Carrington Primary and Nursery School","Null",495,129,675,51,7488,180,32423.040000000001,32603.040000000001,34293.599999999999,-1690.5599999999977,-1691,"NA","NA"]
["2894TF3X",2894,"Claremont Primary and Nursery School","Null",585,0,585,0,7020,180,30396.600000000002,30576.600000000002,31212.879069767445,-636.27906976744271,-636,"NA","NA"]
["2153J=#h",2153,"Crab Tree Farm Primary","Null",855,30,885,0,10620,2700,45984.6,48684.6,67913.951351351367,-19229.351351351368,-19229,"NA","NA"]
["3323uAnN",3323,"Dovecote Primary and Nursery School","Null",1020,135,1155,0,13860,1980,60013.8,61993.8,64953.9,-2960.0999999999985,-2960,"NA","NA"]
["2061*=Dv",2061,"Dunkirk Primary and Nursery School","Null",465,15,480,0,5760,540,24940.799999999999,25480.799999999999,26395.200000000001,-914.40000000000146,-914,"NA","NA"]
["2016y9WT",2016,"Fernwood Primary (was Infants)","Null",1170,390,1560,0,18720,720,81057.600000000006,81777.600000000006,81984.33267326733,-206.73267326732457,-207,"NA","NA"]
["29299aP3",2929,"Forest Fields Primary and Nursery School","Null",840,30,870,0,10440,1260,45205.200000000004,46465.200000000004,44333.666666666664,2131.5333333333401,2132,"NA","NA"]
["2360v3Rm",2360,"Glade Hill Primary School","Null",855,180,1170,135,12420,2340,53778.6,56118.6,61366.764705882357,-5248.1647058823582,-5248,"NA","NA"]
["3324t4Zr",3324,"Greenfields Community School","Null",495,30,780,255,6300,1260,27279,28539,49356,-20817,-20817,"NA","NA"]
["2163ZV#U",2163,"Haydn Primary School","Null",780,285,1065,0,12780,1080,55337.4,56417.4,52946.31549295775,3471.0845070422511,3471,"NA","NA"]
["2095PeXY",2095,"Heathfield Primary and Nursery School","Null",1395,210,1605,0,19260,4320,83395.8,87715.8,95487.824999999997,-7772.0249999999942,-7772,"NA","NA"]
["2170t#+k",2170,"Hempshill Hall Primary School","Null",750,0,750,0,9000,1260,38970,40230,40820.400000000001,-590.40000000000146,-590,"NA","NA"]
["3328#Lxm",3328,"Henry Whipple Primary School","Null",510,75,585,0,7020,1800,30396.600000000002,32196.600000000002,25472.322580645163,6724.2774193548394,6724,"NA","NA"]
["2079eX>T",2079,"Melbury Primary School","Null",435,0,435,0,5220,1620,22602.600000000002,24222.600000000002,30173.594594594593,-5950.994594594591,-5951,"NA","NA"]
["2158H?mY",2158,"Mellers Primary and Nursery School","Null",900,45,1295,350,11340,2880,49102.200000000004,51982.200000000004,56294.584615384614,-4312.3846153846098,-4312,"NA","NA"]
{"$rows_left_out":59}
{"sheet":"Adj indicative","index":3,"n_rows":81,"n_cols":52,"rows_kept":81,"cut":false,"hidden":true,"merged":[[2,44,2,45],[2,46,2,47],[2,48,3,48],[2,51,3,51],[1,42,1,51],[2,42,2,43],[2,38,3,38],[2,18,2,19],[2,20,2,21],[2,22,2,23],[2,24,2,25],[2,27,3,27],[1,0,2,5],[1,6,1,15],[1,18,1,26],[1,29,1,37],[2,29,2,30],[2,31,2,32],[2,33,2,34],[2,35,2,36],[2,6,2,7],[2,8,2,9],[2,10,2,11],[2,12,2,13],[2,16,3,16]]}
["M:\\Finance7\\PLANNING & PROJECTS\\School Budgets\\2018-19\\Early years\\Oracle budget 1819v2.xlsx",null,null,null,null,null,null,null,12,"weeks",4.33,null,1,null,null,0.53,null,null,null,null,14,"weeks",4.33,null,1,null,0.53,null,null,null,null,12,"weeks",4.33,null,1,null,0.53]
[null,null,null,null,null,null,"SUMMER TERM",null,null,null,null,null,null,null,null,null,"Initial Payment",null,"AUTUMN",null,null,null,null,null,null,null,null,"Initial Payment",null,"SPRING",null,null,null,null,null,null,null,null,null,"Initial Payment",null,null,"TOTAL"]
[null,null,null,null,null,null,"Pupils",null,"Funded Hours",null,"Base Rate funding",null,"Deprivation funding",null,null,"EYPP","Total for Summer initial payment not including EYPP",null,"Pupils",null,"Funded Hours",null,"Base Rate funding",null,"Deprivation funding",null,"EYPP","Total for Autumn initial payment not including EYPP",null,"Pupils",null,"Funded Hours",null,"Base Rate funding",null,"Deprivation funding",null,"EYPP","Total for Spring initial payment not including EYPP","75% payment",null,null,"Funded Hours",null,"Base Rate funding",null,"Deprivation funding",null,"EYFF","Check",null,"EYPP"]
["Passcode","2017 passcodes","DfE","School Name",null,"Estimated EYPP %","Universal","Extended","Universal","Extended","Universal","Extended","Universal","Extended",null,null,null,null,"Universal","Extended","Universal","Extended","Universal","Extended","Universal","Extended",null,null,null,"Universal","Extended","Universal","Extended","Universal","Extended","Universal","Extended",null,null,null,null,null,"Universal","Extended","Universal","Extended","Universal","Extended"]
["2017bKjU","2917ZuVe",2017,"Springfield Primary","A",0.32,10,0,1800,0,7794,0,576,0,null,305.28000000000003,8370,null,14,0,2940,0,12730.2,0,940.80000000000007,0,498.62400000000008,13671,null,19,0,3420,0,14808.6,0,1094.4000000000001,0,580.03200000000004,15903,11927.25,null,null,8160,0,35332.800000000003,0,2611.2000000000003,0,37944,37944,0,1383.9360000000001]
["3312vqSr","3312Qybe",3312,"South Wilford Endowed Ce Aided","A",null,null,null,null,null,null,null,null,null,null,null,0,null,null,null,null,null,null,null,null,0,null,0,null,null,null,null,null,null,null,null,null,null,0,0,null,null,null,null,null,null,null,null,null,0,0]
["6907S&Ue","6907FCPz",6907,"Nottingham Academy","A",8.771929824561403E-2,150,0,27000,0,116910,0,2368.4210526315787,0,null,1255.2631578947369,119278.42105263157,null,93,0,19530,0,84564.9,0,1713.1578947368421,0,907.97368421052636,86278.057894736834,null,115,0,20700,0,89631,0,1815.7894736842104,0,962.36842105263156,91446.789473684214,68585.09210526316,null,null,67230,0,291105.90000000002,0,5897.3684210526317,0,297003.26842105266,297003.26842105261,0,3125.605263157895]
["2002ubNR","2002riNz",2002,"Ambleside Primary School","A",0.27049180327868855,130,0,23400,0,101322,0,6329.5081967213118,0,null,3354.6393442622953,107651.50819672132,null,95,0,19950,0,86383.5,0,5396.3114754098369,0,2860.0450819672137,91779.811475409835,null,110,0,19800,0,85734,0,5355.7377049180332,0,2838.5409836065578,91089.737704918036,68317.303278688531,null,null,63150,0,273439.5,0,17081.557377049183,0,290521.05737704918,290521.05737704918,0,9053.2254098360663]
["2003ZgFG","2003cUCo",2003,"St. .Augustines Voluntary Academy","A",0.24444444444444444,52,0,9360,0,40528.800000000003,0,2288,0,null,1212.6400000000001,42816.800000000003,null,30,0,6300,0,27279,0,1540,0,816.2,28819,null,40,0,7200,0,31176,0,1760,0,932.80000000000007,32936,24702,null,null,22860,0,98983.8,0,5588,0,104571.8,104571.8,0,2961.6400000000003]
["2004A4G9","2004bGWt",2004,"Windmill L.E.A.D. Academy","A",7.6923076923076927E-2,52,4,9360,720,40528.800000000003,3117.6,720,55.384615384615387,null,381.6,44421.784615384619,null,51,4,10710,840,46374.3,3637.2000000000003,823.84615384615392,64.615384615384613,436.63846153846163,50899.961538461539,null,53,4,9540,720,41308.199999999997,3117.6,733.84615384615392,55.384615384615387,388.93846153846158,45215.030769230769,33911.273076923077,null,null,29610,2280,128211.3,9872.4,2277.6923076923076,175.38461538461539,140536.77692307695,140536.77692307692,0,1207.1769230769232]
["2005Vb2Z","2005HQuH",2005,"Firbeck Academy","A",0.1702127659574468,32,6,5760,1080,24940.799999999999,4676.3999999999996,980.42553191489355,183.82978723404256,null,519.6255319148936,30781.455319148932,null,30,1,6300,210,27279,909.30000000000007,1072.3404255319149,35.744680851063826,568.34042553191489,29296.385106382979,null,33,1,5940,180,25720.2,779.4,1011.063829787234,30.638297872340424,535.86382978723407,27541.302127659579,20655.976595744683,null,null,18000,1470,77940,6365.0999999999995,3063.8297872340427,250.21276595744681,87619.142553191501,87619.142553191487,0,1623.8297872340427]
["2008dK%E","2008VkKp",2008,"Highbank Primary School","A",0.31818181818181818,44,0,7920,0,34293.599999999999,0,2520,0,null,1335.6000000000001,36813.599999999999,null,23,0,4830,0,20913.900000000001,0,1536.8181818181818,0,814.51363636363635,22450.718181818182,null,38,0,6840,0,29617.200000000001,0,2176.3636363636365,0,1153.4727272727273,31793.563636363637,23845.172727272729,null,null,19590,0,84824.7,0,6233.181818181818,0,91057.881818181821,91057.881818181806,0,3303.5863636363638]
["2009mqy&","2009jKrj",2009,"Glenbrook Primary","A",0.39285714285714285,40,0,7200,0,31176,0,2828.5714285714284,0,null,1499.1428571428571,34004.571428571428,null,31,0,6510,0,28188.3,0,2557.5,0,1355.4750000000001,30745.8,null,25,0,4500,0,19485,0,1767.8571428571429,0,936.96428571428578,21252.857142857141,15939.642857142855,null,null,18210,0,78849.3,0,7153.9285714285716,0,86003.228571428568,86003.228571428568,0,3791.582142857143]
["20104ym9","2010wBMV",2010,"Portland School","A",0.25806451612903225,62,2,11160,360,48322.8,1558.8,2880,92.903225806451616,null,1526.4,52854.50322580646,null,37,0,7770,0,33644.1,0,2005.1612903225805,0,1062.7354838709678,35649.261290322582,null,46,0,8280,0,35852.400000000001,0,2136.7741935483868,0,1132.4903225806452,37989.174193548388,28491.880645161291,null,null,27210,360,117819.29999999999,1558.8,7021.9354838709678,92.903225806451616,126492.93870967742,126492.93870967743,0,3721.6258064516128]
["2011zpHr","2011poYO",2011,"Djanogly Strelley Academy","A",0.20588235294117646,68,10,12240,1800,52999.200000000004,7794,2520,370.58823529411762,null,1335.6000000000001,63683.788235294123,null,37,8,7770,1680,33644.1,7274.4000000000005,1599.705882352941,345.88235294117646,847.84411764705874,42864.088235294119,null,40,10,7200,1800,31176,7794,1482.3529411764705,370.58823529411762,785.64705882352939,40822.941176470587,30617.205882352941,null,null,27210,5280,117819.3,22862.400000000001,5602.0588235294108,1087.0588235294117,147370.81764705881,147370.81764705881,0,2969.0911764705884]
["2012QZ#L","2012cGfy",2012,"Jubilee Primary School","A",0.84615384615384615,52,0,9360,0,40528.800000000003,0,7920,0,null,4197.6000000000004,48448.800000000003,null,18,0,3780,0,16367.4,0,3198.4615384615386,0,1695.1846153846154,19565.861538461537,null,51,0,9180,0,39749.4,0,7767.6923076923076,0,4116.876923076923,47517.092307692306,35637.81923076923,null,null,22320,0,96645.6,0,18886.153846153848,0,115531.75384615385,115531.75384615385,0,10009.66153846154]
["2013u!Bd","2013rLUm",2013,"Rosslyn Park Primary And Nursery School","A",0.51578947368421058,104,0,18720,0,81057.600000000006,0,9655.5789473684217,0,null,5117.4568421052636,90713.178947368433,null,74,0,15540,0,67288.2,0,8015.3684210526326,0,4248.1452631578959,75303.568421052623,null,97,0,17460,0,75601.8,0,9005.6842105263167,0,4773.0126315789485,84607.484210526323,63455.613157894739,null,null,51720,0,223947.59999999998,0,26676.63157894737,0,250624.23157894734,250624.23157894739,0,14138.614736842108]
["2014mAj9","2014sKZl",2014,"Brocklewood Primary And Nursery School","A",0.32786885245901637,57,14,10260,2520,44425.8,10911.6,3363.9344262295081,826.22950819672121,null,1782.8852459016393,59527.563934426231,null,31,5,6510,1050,28188.3,4546.5,2134.4262295081967,344.26229508196718,1131.2459016393443,35213.488524590161,null,35,5,6300,900,27279,3897,2065.5737704918033,295.08196721311475,1094.7540983606559,33536.655737704925,25152.491803278695,null,null,23070,4470,99893.1,19355.099999999999,7563.9344262295072,1465.5737704918031,128277.70819672132,128277.7081967213,0,4008.8852459016398]
["2018v$Lg","2015HbKT",2018,"Victoria Primary School","A",5.8823529411764705E-2,39,3,7020,540,30396.600000000002,2338.1999999999998,412.94117647058823,31.764705882352942,null,218.85882352941178,33179.50588235294,null,24,0,5040,0,21823.200000000001,0,296.47058823529409,0,157.12941176470588,22119.670588235294,null,30,0,5400,0,23382,0,317.64705882352939,0,168.35294117647058,23699.647058823528,17774.735294117647,null,null,17460,540,75601.8,2338.1999999999998,1027.0588235294117,31.764705882352942,78998.823529411762,78998.823529411762,0,544.34117647058827]
["2019N2K2","2019Xnfp",2019,"Bluecoat Primary Academy","A",0,26,6,4680,1080,20264.400000000001,4676.3999999999996,0,0,null,0,24940.800000000003,null,26,6,5460,1260,23641.8,5455.8,0,0,0,29097.599999999999,null,26,6,4680,1080,20264.400000000001,4676.3999999999996,0,0,0,24940.800000000003,18705.600000000002,null,null,14820,3420,64170.6,14808.6,0,0,78979.199999999997,78979.200000000012,0,0]
{"$rows_left_out":62}
{"sheet":"2 YO","index":4,"n_rows":49,"n_cols":8,"rows_kept":49,"cut":false,"hidden":true,"merged":[]}
["SchoolName","Surname","School code","Eligibile:","Hours: ","ELIGIBLE FOR ELP  YES/NO","School code",5.08]
[15,"The Nottingham Nursery School and Training Centre",1012,"Y",914.40000000000009,"Y","1012WG6k"]
[15,"The Nottingham Nursery School and Training Centre",1012,"Y",914.40000000000009,"Y","1012WG6k"]
[15,"The Nottingham Nursery School and Training Centre",1012,"Y",914.40000000000009,"Y","1012WG6k"]
[15,"The Nottingham Nursery School and Training Centre",1012,"Y",914.40000000000009,"Y","1012WG6k"]
[15,"The Nottingham Nursery School and Training Centre",1012,"Y",914.40000000000009,"Y","1012WG6k"]
[15,"The Nottingham Nursery School and Training Centre",1012,"Y",914.40000000000009,"Y","1012WG6k"]
[15,"The Nottingham Nursery School and Training Centre",1012,"Y",914.40000000000009,"Y","1012WG6k"]
[15,"The Nottingham Nursery School and Training Centre",1012,"Y",914.40000000000009,"Y","1012WG6k"]
[15,"The Nottingham Nursery School and Training Centre",1012,"Y",914.40000000000009,"Y","1012WG6k"]
[15,"The Nottingham Nursery School and Training Centre",1012,"Y",914.40000000000009,"Y","1012WG6k"]
[15,"The Nottingham Nursery School and Training Centre",1012,"Y",914.40000000000009,"Y","1012WG6k"]
[15,"The Nottingham Nursery School and Training Centre",1012,"Y",914.40000000000009,"Y","1012WG6k"]
[15,"The Nottingham Nursery School and Training Centre",1012,"Y",914.40000000000009,"Y","1012WG6k"]
[15,"The Nottingham Nursery School and Training Centre",1012,"Y",914.40000000000009,"Y","1012WG6k"]
[15,"The Nottingham Nursery School and Training Centre",1012,"Y",914.40000000000009,"Y","1012WG6k"]
[15,"The Nottingham Nursery School and Training Centre",1012,"Y",914.40000000000009,"Y","1012WG6k"]
[15,"The Nottingham Nursery School and Training Centre",1012,"Y",914.40000000000009,"Y","1012WG6k"]
[15,"The Nottingham Nursery School and Training Centre",1012,"Y",914.40000000000009,"Y","1012WG6k"]
[15,"The Nottingham Nursery School and Training Centre",1012,"Y",914.40000000000009,"Y","1012WG6k"]
{"$rows_left_out":30}
{"sheet":"EY PP","index":5,"n_rows":77,"n_cols":6,"rows_kept":77,"cut":false,"hidden":true,"merged":[]}
[null,"EY PP Summer Term",null,"EY PP Summer Term"]
[null,null,null,null,"Rate",0.53]
[null,null,null,null,"Weeks",12]
["Acad/Main","Passcode","NativeID","SchoolName","Eligible Hours","Funding"]
["M","2045a%7K",8922045,"Bentinck Primary School",75,477]
["M","2006K8b8",8922006,"Berridge Primary School",135,859]
["M","2056&z#7",8922056,"CANTRELL PRIMARY",112.5,716]
["M","2057JagM",8922057,"CARRINGTON PRIMARY SCHOOL",15,95]
["M","2894TF3X",8922894,"Claremont Primary School",15,95]
["M","2153J=#h",8922153,"Crabtree Farm Primary and Nursery School",225,1431]
["M","3323uAnN",8923323,"Dovecote Primary",165,1049]
["M","2061*=Dv",8922061,"Dunkirk Primary School",30,191]
["M","2016y9WT",8922016,"Fernwood Primary School",60,382]
["M","29299aP3",8922929,"Forest Fields Primary School",105,668]
["M","2360v3Rm",8922360,"Glade Hill Primary School",195,1240]
["M","3324t4Zr",8923324,"Greenfields Community Primary",105,668]
["M","2163ZV#U",8922163,"Haydn Primary School",60,382]
["M","2095PeXY",8922095,"HEATHFIELD PRIMARY & NURSERY SCHOOL",360,2290]
["M","2170t#+k",8922170,"Hempshill Hall Primary School",105,668]
["M","3328#Lxm",8923328,"Henry Whipple Primary School",150,954]
{"$rows_left_out":58}
{"sheet":"EYPP Pupils","index":6,"n_rows":711,"n_cols":7,"rows_kept":711,"cut":false,"hidden":false,"merged":[]}
[]
[null,{"$f":"+IF('Early Years Funding'!A7=\"\",\"\",LEFT('Early Years Funding'!A7,4))","v":""},{"$f":"+'Early Years Funding'!B7","v":""},{"$f":"+'Early Years Funding'!A7","v":0}]
[]
["Passcode","DFE","SCHOOL","UPN or Date of Birth","HOURS/WEEK","Summer TERM HOURS","Summer Term EYPP"]
["2002ubNR",2020,"Ambleside Primary Academy","M892200217090",15,180,95.4]
["2002ubNR",2020,"Ambleside Primary Academy","Y892200217031",15,180,95.4]
["2002ubNR",2020,"Ambleside Primary Academy","F892200217026",15,180,95.4]
["2002ubNR",2020,"Ambleside Primary Academy","J892200217028",15,180,95.4]
["2002ubNR",2020,"Ambleside Primary Academy","J892200517010",15,180,95.4]
["2002ubNR",2020,"Ambleside Primary Academy","F892202017010",15,180,95.4]
["2002ubNR",2020,"Ambleside Primary Academy","H892200216065",15,180,95.4]
["2002ubNR",2020,"Ambleside Primary Academy","F891379316045",15,180,95.4]
["2002ubNR",2020,"Ambleside Primary Academy","N892202017005",15,180,95.4]
["2002ubNR",2020,"Ambleside Primary Academy","W892200216046",15,180,95.4]
["2002ubNR",2020,"Ambleside Primary Academy","N892200217079",15,180,95.4]
["2002ubNR",2020,"Ambleside Primary Academy","C892200216079",15,180,95.4]
["2002ubNR",2020,"Ambleside Primary Academy","A892200217069",15,180,95.4]
["2002ubNR",2020,"Ambleside Primary Academy","L892200217068",15,180,95.4]
["2002ubNR",2020,"Ambleside Primary Academy","U892200216093",15,180,95.4]
["2002ubNR",2020,"Ambleside Primary Academy","C892202017006",15,180,95.4]
{"$rows_left_out":691}