{"text_format":"1","workbook":"xlsx","n_sheets":6,"sheets":["Early Years Funding","3&4","Adj indicative","2 YO","EY PP","EYPP Pupils"],"not_rendered":{"charts":0,"images":1,"macros":1,"external_links":0,"defined_names":6,"comments":0,"pivot_tables":0},"unopened":[],"bounds":{"document_bytes":16777216,"sheet_cells":100000,"rows_first":2000,"rows_last":500,"rows_between":2000,"halvings":0,"cell_chars":16384,"cell_head_chars":4096},"cells_cut":0,"cells_raw":0,"read":"whole","date_system":"1900"}

{"sheet":"Early Years Funding","index":0,"n_rows":30,"n_cols":8,"rows_kept":30,"cut":false,"hidden":false,"merged":[[6,1,6,7],[8,6,8,7],[8,3,8,4],[8,0,8,1]]}
[]
[]
[]
[]
["Early Years Funding - Summer Term Final"]
[]
[null,{"$f":"+IF(A7=\"\",\"\",VLOOKUP(A7,'3&4'!A3:C75,3,FALSE))","v":""}]
[{"$f":"IF(A7=\"\",\"Please enter you 8 digit passcode in the blue box above\",\"\")","v":"Please enter you 8 digit passcode in the blue box above"}]
["3 & 4 Year Old Funding",null,null,"2 Year Old Funding",null,null,"Early Years Pupil Premium"]
[]
["Base Rate",4.25,null,"Hourly Rate",{"$f":"+'2 YO'!K1","v":5.03},null,"Hourly Rate",{"$f":"+'EY PP'!F2","v":0.53}]
[]
["Estimated Funded Hours",{"$f":"+IF(ISNA(VLOOKUP($A$7,'Adj indicative'!A$1:O$82,6,FALSE)),0,VLOOKUP($A$7,'Adj indicative'!A$1:O$82,6,FALSE))+IF(ISNA(VLOOKUP($A$7,'Adj indicative'!A$1:O$82,6,FALSE)),0,VLOOKUP($A$7,'Adj indicative'!A$1:O$82,7,FALSE))","v":0},null,"Funded Hours",{"$f":"+SUMIFS('2 YO'!$E$2:$E$114,'2 YO'!$H$2:$H$114,\"Y\",'2 YO'!$I$2:$I$114,A7)","v":0},null,"Funded Hours",{"$f":"+IF(ISNA(VLOOKUP(A7,'EY PP'!$B$5:$F$72,4,FALSE)),0,VLOOKUP(A7,'EY PP'!$B$5:$F$72,4,FALSE))","v":0}]
["Estimated Base Rate Funding",{"$f":"+B13*B11","v":0},null,"Funded Weeks",12,null,"Funded Weeks",12]
["Estimated Deprivation Funding",{"$f":"+IF(ISNA(VLOOKUP($A$7,'Adj indicative'!A$1:AK$82,31,FALSE)),0,VLOOKUP($A$7,'Adj indicative'!A$1:AK$82,31,FALSE))+IF(ISNA(VLOOKUP($A$7,'Adj indicative'!A$1:AK$82,32,FALSE)),0,VLOOKUP($A$7,'Adj indicative'!A$1:AK$82,32,FALSE))","v":0}]
["Summer Initial Payment",{"$f":"SUM(B14+B15)","v":0}]
[]
["Actual Funded Hours",{"$f":"+IF(ISNA(VLOOKUP($A$7,'3&4'!$A$1:$G$75,6,FALSE)),0,VLOOKUP($A$7,'3&4'!$A$1:$G$75,6,FALSE))","v":0}]
["Actual Base Rate Funding",{"$f":"B18*B11","v":0}]
["Actual Deprivation Funding",{"$f":"+IF(ISNA(VLOOKUP($A$7,'3&4'!$A$1:$G$75,7,FALSE)),0,VLOOKUP($A$7,'3&4'!$A$1:$G$75,7,FALSE))","v":0}]
["Summer Final Funding",{"$f":"SUM(B19+B20)","v":0}]
[]
["Summer Term Final Adjustment",{"$f":"+B21-B16","v":0},null,"Summer Term Funding",{"$f":"+E13*E14*E11","v":0},null,"Summer Term Funding",{"$f":"+H13*H14*H11","v":0}]
["Autumn Estimate",{"$f":"+IF(ISNA(VLOOKUP($A$7,'Adj indicative'!A$1:AL$82,14,FALSE)),0,VLOOKUP($A$7,'Adj indicative'!A$1:AL$82,14,FALSE))+IF(ISNA(VLOOKUP($A$7,'Adj indicative'!A$1:AL$82,15,FALSE)),0,VLOOKUP($A$7,'Adj indicative'!A$1:AL$82,15,FALSE))+IF(ISNA(VLOOKUP($A$7,'Adj indicative'!A$1:AL$82,36,FALSE)),0,VLOOKUP($A$7,'Adj indicative'!A$1:AL$82,36,FALSE))","v":0}]
["September Payment",{"$f":"IF(B23+B24>0,B23+B24,0)","v":0}]
[]
["Notes:"]
["1.  The 8 digit passcode was sent to all headteachers on 27th February 2017.  If you do not know your school passcode please email:"]
["school.funding@nottinghamcity.gov.uk"]
["2.  Data has been used from the termly census."]
{"$rows_left_out":1}
{"sheet":"3&4","index":1,"n_rows":76,"n_cols":14,"rows_kept":76,"cut":false,"hidden":true,"merged":[]}
[null,null,null,"Weeks",12]
["Passocde","DFE","School Name","Status","Summer Census Weekly Hours","Summer Term Funded Hours","Deprivation","Base Rate","Summer Term Funding","Estimated Funding","Variance actual v est","Maintained Schools Budget Share Adjustments","Academies Initial Payment","Academies Final Payment"]
["2045jcKb",2045,"Bentinck Primary and Nursery School","Null",650,7800,900,33150,34050,37560,-3510,-3510,"NA","NA"]
["2006MAGL",2006,"Berridge Primary","Null",1305,15660,1260,66555,67815,88155,-20340,-20340,"NA","NA"]
["2056bAuD",2056,"Cantrell Primary and Nursery School","Null",870,10440,1560,44370,45930,52125,-6195,-6195,"NA","NA"]
["2057HOsi",2057,"Carrington Primary and Nursery School","Null",580,6960,0,29580,29580,32610,-3030,-3030,"NA","NA"]
["2894TISR",2894,"Claremont Primary and Nursery School","Null",912.5,10950,1200,46537.5,47737.5,43477.5,4260,4260,"NA","NA"]
["2153nWDQ",2153,"Crab Tree Farm Primary","Null",1110,13320,5940,56610,62550,62865,-315,-315,"NA","NA"]
["3323oqtU",3323,"Dovecote Primary and Nursery School","Null",1200,14400,1800,61200,63000,61485,1515,1515,"NA","NA"]
["2061xJcy",2061,"Dunkirk Primary and Nursery School","Null",790,9480,1020,40290,41310,38880,2430,2430,"NA","NA"]
["2016jnOu",2129,"Fernwood Primary (was Infants)","Null",1515,18180,900,77265,78165,80460,-2295,-2295,"NA","NA"]
["2929hDZn",2929,"Forest Fields Primary and Nursery School","Null",1300,15600,2400,66300,68700,69060,-360,-360,"NA","NA"]
["2360ioBv",2360,"Glade Hill Primary School","Null",969,11628,2412,49419,51831,53076,-1245,-1245,"NA","NA"]
["3324xTCS",3324,"Greenfields Community School","Null",585,7020,1680,29835,31515,33705,-2190,-2190,"NA","NA"]
["2163KqTk",2163,"Haydn Primary School","Null",1065,12780,1620,54315,55935,56160,-225,-225,"NA","NA"]
["2095dtuN",2095,"Heathfield Primary and Nursery School","Null",1960,23520,8820,99960,108780,79170,29610,29610,"NA","NA"]
["2170MqVW",2170,"Hempshill Hall Primary School","Null",900,10800,1260,45900,47160,55890,-8730,-8730,"NA","NA"]
["3328RPTm",3328,"Henry Whipple Primary School","Null",525,6300,2760,26775,29535,28170,1365,1365,"NA","NA"]
["2079FvIw",2079,"Melbury Primary School","Null",555,6660,3060,28305,31365,36360,-4995,-4995,"NA","NA"]
["2158hMrS",2158,"Mellers Primary and Nursery School","Null",650,7800,2100,33150,35250,38700,-3450,-3450,"NA","NA"]
["2080tRdj",2080,"Middleton Primary and Nursery School","Null",1302,15624,300,66402,66702,61920,4782,4782,"NA","NA"]
["7042NwsN",7042,"Oak Field School","Null",45,540,360,2295,2655,3240,-585,-585,"NA","NA"]
["2151vOUw",2151,"Rise Park Primary and Nursery School","Null",1420,17040,3960,72420,76380,80280,-3900,-3900,"NA","NA"]
["3329RIdN",3329,"Robin Hood Primary School","Null",1465,17580,3780,74715,78495,81585,-3090,-3090,"NA","NA"]
["3332hTln",3332,"Rufford Primary School","Null",780,9360,3600,39780,43380,43740,-360,-360,"NA","NA"]
["2007acGn",2007,"Seely Primary","Null",1040,12480,2160,53040,55200,62265,-7065,-7065,"NA","NA"]
["2897xXHv",2897,"Snape Wood Primary and Nursery School","Null",645,7740,2700,32895,35595,50760,-15165,-15165,"NA","NA"]
["3326cFKo",3326,"Southglade Primary School","Null",1500,18000,8700,76500,85200,87825,-2625,-2625,"NA","NA"]
["2128wfAl",2128,"Southwold Primary School and Early Years' Centre","Null",960,11520,4740,48960,53700,44850,8850,8850,"NA","NA"]
["2190wUmX",2190,"Stanstead Nursery and Primary School","Null",476,5712,2100,24276,26376,35238,-8862,-8862,"NA","NA"]
{"$rows_left_out":47}
{"sheet":"Adj indicative","index":2,"n_rows":84,"n_cols":47,"rows_kept":84,"cut":false,"hidden":true,"merged":[[3,13,3,14],[3,3,3,4],[3,5,3,6],[3,7,3,8],[3,9,3,10],[3,11,3,12],[2,38,2,42],[3,15,3,16],[3,17,3,18],[3,19,3,20],[3,21,3,22],[2,3,2,8],[2,9,2,14],[2,15,2,20],[2,28,2,32],[2,33,2,37]]}
[null,null,null,"Indicative EY Base rate funding 2017/18",null,null,null,null,null,null,null,null,null,null,null,null,null,null,null,null,null,null,null,null,null,null,null,null,"Indicative EY Deprivation Funding 2017/18"]
[]
[null,null,null,"SUMMER TERM 2016",null,null,null,null,null,"AUTUMN TERM 2016",null,null,null,null,null,"SPRING TERM 2016",null,null,null,null,null,null,null,null,null,null,null,null,"SUMMER TERM",null,null,null,null,"AUTUMN TERM",null,null,null,null,"SPRING TERM"]
[null,null,null,"Number of Children Accessing",null,"Total Funded hours",null,"Indicative Base rate funding",null,"Number of Children Accessing",null,"Total Funded hours",null,"Indicative Base rate funding",null,"Number of Children Accessing",null,"Total Funded hours",null,"Indicative Base rate funding",null,"Total Indicative 2017/18 Base rate funding",null,null,null,null,45,null,"Estimate eligible EYPP children accessing",null,"Deprivation funding",null,null,"Estimate eligible EYPP children accessing",null,"Deprivation Funding",null,null,"Estimate eligible EYPP children accessing",null,"Deprivation Funding",null,null,"Total Indicative 2017/18 Deprivation funding"]
["Passcode","DfE","School","Universal 15 hour entitlement","Local additional hours","Universal 15 hour entitlement","Local additional hours","Universal 15 hour entitlement","Local additional hours","Universal 15 hour entitlement","National additional entitlement for working parents","Universal 15 hour entitlement","National additional entitlement for working parents","Universal 15 hour entitlement","National additional entitlement for working parents","Universal 15 hour entitlement","National additional entitlement for working parents","Universal 15 hour entitlement","National additional entitlement for working parents","Universal 15 hour entitlement","National additional entitlement for working parents","Universal 15 hour entitlement","Additional hours",null,"Passcode","DfE","School","Assumed % pupils eligible for EYPP","Universal 15 hour entitlement only","Local additional hours","Universal 15 hour entitlement hours","Local additional hours","EYPP","Universal 15 hour entitlement","National additional entitlement for working parents","Universal 15 hour entitlement hours","National additional entitlement hours for working parents","EYPP","Universal 15 hour entitlement","National additional entitlement for working parents","Universal 15 hour entitlement hours","National additional entitlement hours for working parents","EYPP","Universal 15 hour entitlement hours","Additional hours","EYPP"]
["2002riNz",2002,"AMBLESIDE PRIMARY SCHOOL",141,0,25380,0,107865,0,82,null,17220,0,73185,0,120,null,21600,0,91800,0,272850,0,null,"2002riNz",2002,"AMBLESIDE PRIMARY SCHOOL",0.321656050955414,45,0,8100,0,4293,26,0,5460,0,2893.8,39,0,7020,0,3720.6000000000004,20580,0,10907.400000000001,0]
["2045jcKb",2045,"Bentinck Primary School",34,17,6120,2040,26010,8670,24,null,5040,0,21420,0,34,null,6120,0,26010,0,73440,8670,null,"2045jcKb",2045,"Bentinck Primary School",0.34466019417475702,12,6,2160,720,1144.8,8,0,1680,0,890.40000000000009,12,0,2160,0,1144.8,6000,720,3180,0]
["2006MAGL",2006,"Berridge Primary School",111,0,19980,0,84915,0,60,null,12600,0,53550,0,87,null,15660,0,66555,0,205020,0,null,"2006MAGL",2006,"Berridge Primary School",0.16260162601625999,18,0,3240,0,1717.2,10,0,2100,0,1113,14,0,2520,0,1335.6000000000001,7860,0,4165.8,0]
["3319QBOK",3319,"Blessed Robert Widmerpool Catholic Voluntary Academy",59,0,10620,0,45135,0,42,null,8820,0,37485,0,51,null,9180,0,39015,0,121635,0,null,"3319QBOK",3319,"Blessed Robert Widmerpool Catholic Voluntary Academy",4.1095890410958902E-2,2,0,360,0,190.8,2,0,420,0,222.60000000000002,2,0,360,0,190.8,1140,0,604.20000000000005,0]
["2183JqYY",2183,"BLUE BELL HILL PRIMARY SCHOOL",66,0,11880,0,50490,0,55,null,11550,0,49087.5,0,59,null,10620,0,45135,0,144712.5,0,null,"2183JqYY",2183,"BLUE BELL HILL PRIMARY SCHOOL",0.30272952853598001,20,0,3600,0,1908,17,0,3570,0,1892.1000000000001,18,0,3240,0,1717.2,10410,0,5517.3,0]
["4615dHTk",4615,"BLUECOAT ACADEMY",0,0,0,0,0,0,26,null,5460,0,23205,0,26,null,4680,0,19890,0,43095,0,null,"4615dHTk",4615,"BLUECOAT ACADEMY",0.182352941176471,0,0,0,0,0,5,0,1050,0,556.5,5,0,900,0,477,1950,0,1033.5,0]
["2014sKZl",2014,"Brocklewood Primary School",79,0,14220,0,60435,0,46,null,9660,0,41055,0,61,null,10980,0,46665,0,148155,0,null,"2014sKZl",2014,"Brocklewood Primary School",0.44088176352705399,35,0,6300,0,3339,20,0,4200,0,2226,27,0,4860,0,2575.8000000000002,15360,0,8140.8,0]
["3000JAIt",3000,"BULWELL ST. MARYS C. OF E.",36,12,5940,1440,25245,6120,27,null,5670,0,24097.5,0,33,null,5940,0,25245,0,74587.5,6120,null,"3000JAIt",3000,"BULWELL ST. MARYS C. OF E.",0.30584192439862501,11,4,1980,480,1049.4000000000001,8,0,1680,0,890.40000000000009,10,0,1800,0,954,5460,480,2893.8,0]
["2082fWlx",2082,"BURFORD PRIMARY & NURSERY",48,0,8640,0,36720,0,22,null,4620,0,19635,0,38,null,6840,0,29070,0,85425,0,null,"2082fWlx",2082,"BURFORD PRIMARY & NURSERY",0.29951690821256,14,0,2520,0,1335.6000000000001,7,0,1470,0,779.1,11,0,1980,0,1049.4000000000001,5970,0,3164.1000000000004,0]
["2056bAuD",2056,"Cantrell Primary & Nurs",70,0,11460,0,48705,0,34,null,7140,0,30345,0,64,null,11520,0,48960,0,128010,0,null,"2056bAuD",2056,"Cantrell Primary & Nurs",0.26491646778042999,19,0,3420,0,1812.6000000000001,9,0,1890,0,1001.7,17,0,3060,0,1621.8000000000002,8370,0,4436.1000000000004,0]
["2057HOsi",2057,"Carrington Pri & Nurs",31,17,5580,1980,23715,8415,17,null,3570,0,15172.5,0,28,null,5040,0,21420,0,60307.5,8415,null,"2057HOsi",2057,"Carrington Pri & Nurs",7.7669902912621394E-2,2,1,360,120,190.8,1,0,210,0,111.30000000000001,2,0,360,0,190.8,930,120,492.90000000000003,0]
["2894TISR",2894,"Claremont Primary School",39,26,6630,3120,28177.5,13260,27,null,5670,0,24097.5,0,31,null,5580,0,23715,0,75990,13260,null,"2894TISR",2894,"Claremont Primary School",0.206632653061224,8,5,1440,600,763.2,6,0,1260,0,667.80000000000007,6,0,1080,0,572.4,3780,600,2003.4,0]
["2153nWDQ",2153,"Crabtree Farm Primary",73,0,13140,0,55845,0,50,null,10500,0,44625,0,61,null,10980,0,46665,0,147135,0,null,"2153nWDQ",2153,"Crabtree Farm Primary",0.53865336658354102,39,0,7020,0,3720.6000000000004,27,0,5670,0,3005.1000000000004,33,0,5940,0,3148.2000000000003,18630,0,9873.9000000000015,0]
["2081LkKD",2081,"Djanogly Northgate Academy",71,0,12780,0,54315,0,51,null,10710,0,45517.5,0,54,null,9720,0,41310,0,141142.5,0,null,"2081LkKD",2081,"Djanogly Northgate Academy",0.25441696113074203,18,0,3240,0,1717.2,13,0,2730,0,1446.9,14,0,2520,0,1335.6000000000001,8490,0,4499.7000000000007,0]
["2011poYO",2011,"Djanogly Strelley Academy",60,0,10800,0,45900,0,37,null,7770,0,33022.5,0,50,null,9000,0,38250,0,117172.5,0,null,"2011poYO",2011,"Djanogly Strelley Academy",0.44358974358974401,27,0,4860,0,2575.8000000000002,16,0,3360,0,1780.8000000000002,22,0,3960,0,2098.8000000000002,12180,0,6455.4000000000005,0]
["3323oqtU",3323,"Dovecote Primary",79,0,13620,0,57885,0,55,null,11550,0,49087.5,0,52,null,9360,0,39780,0,146752.5,0,null,"3323oqtU",3323,"Dovecote Primary",0.24937027707808601,20,0,3600,0,1908,14,0,2940,0,1558.2,13,0,2340,0,1240.2,8880,0,4706.3999999999996,0]
["2061xJcy",2061,"Dunkirk Primary School",40,14,7200,1680,30600,7140,32,null,6720,0,28560,0,33,null,5940,0,25245,0,84405,7140,null,"2061xJcy",2061,"Dunkirk Primary School",0.12254901960784299,5,2,900,240,477,4,0,840,0,445.20000000000005,4,0,720,0,381.6,2460,240,1303.8000000000002,0]
["2099WTff",2099,"Edale Rise Primary and Nursery",48,0,8640,0,36720,0,35,null,7350,0,31237.5,0,43,null,7740,0,32895,0,100852.5,0,null,"2099WTff",2099,"Edale Rise Primary and Nursery",0.28431372549019601,14,0,2520,0,1335.6000000000001,10,0,2100,0,1113,12,0,2160,0,1144.8,6780,0,3593.4000000000005,0]
["2074hvrt",2074,"Edna G Olds Academy",47,20,8460,2400,35955,10200,30,null,6300,0,26775,0,39,null,7020,0,29835,0,92565,10200,null,"2074hvrt",2074,"Edna G Olds Academy",0.27500000000000002,13,6,2340,720,1240.2,8,0,1680,0,890.40000000000009,11,0,1980,0,1049.4000000000001,6000,720,3180.0000000000005,0]
["2016jnOu",2016,"Fernwood Primary School",104,0,18720,0,79560,0,104,null,21840,0,92820,0,104,null,18720,0,79560,0,251940,0,null,"2016jnOu",2016,"Fernwood Primary School",4.8206278026905802E-2,5,0,900,0,477,5,0,1050,0,556.5,5,0,900,0,477,2850,0,1510.5,0]
["2005HQuH",2005,"Firbeck Academy",37,23,6624,1956,28152,8313,35,null,7350,0,31237.5,0,31,null,5580,0,23715,0,83104.5,8313,null,"2005HQuH",2005,"Firbeck Academy",0.25123152709359597,9,6,1620,720,858.6,9,0,1890,0,1001.7,8,0,1440,0,763.2,4950,720,2623.5,0]
["2929hDZn",2929,"Forest Fields Primary School",58,46,10080,5520,42840,23460,50,null,10500,0,44625,0,45,null,8100,0,34425,0,121890,23460,null,"2929hDZn",2929,"Forest Fields Primary School",0.16945996275605199,10,8,1800,960,954,8,0,1680,0,890.40000000000009,8,0,1440,0,763.2,4920,960,2607.6000000000004,0]
["2360ioBv",2360,"Glade Hill Primary School",52,32,9360,2352,39780,9996,34,null,7140,0,30345,0,36,null,6480,0,27540,0,97665,9996,null,"2360ioBv",2360,"Glade Hill Primary School",0.25,13,8,2340,960,1240.2,9,0,1890,0,1001.7,9,0,1620,0,858.6,5850,960,3100.5,0]
["2009jKrj",2009,"Glenbrook Primary",26,18,4680,2160,19890,9180,19,null,3990,0,16957.5,0,25,null,4500,0,19125,0,55972.5,9180,null,"2009jKrj",2009,"Glenbrook Primary",0.41666666666666702,11,8,1980,960,1049.4000000000001,8,0,1680,0,890.40000000000009,10,0,1800,0,954,5460,960,2893.8,0]
["3324xTCS",3324,"Greenfields Community Primary",41,0,7380,0,31365,0,22,null,4620,0,19635,0,36,null,6480,0,27540,0,78540,0,null,"3324xTCS",3324,"Greenfields Community Primary",0.32673267326732702,13,0,2340,0,1240.2,7,0,1470,0,779.1,12,0,2160,0,1144.8,5970,0,3164.1000000000004,0]
{"$rows_left_out":55}
{"sheet":"2 YO","index":3,"n_rows":114,"n_cols":11,"rows_kept":114,"cut":false,"hidden":true,"merged":[]}
["FORENAME","SURNAME","DOB","ONE LINE ADDRESS","ACT HRS WK","PROV NAME","SCHOOL DfE No.:","ELIGIBLE RISING 3'S ","Passcode","Summer term funding",5.03]
["Izaac","Marshall-Lewis",41741,null,15,"Westglade Primary School","3327","Y","3327puJp",905.40000000000009]
["Bilguun","Uuganbayar",41768,null,15,"Henry Whipple Primary School","3328","Y","3328RPTm",905.40000000000009]
["Deborah","Ekanem",41756,null,15,"Robin Hood Primary School","3329","Y","3329RIdN",905.40000000000009]
["Aaron-James","Gnama",41777,null,15,"Robin Hood Primary School","3329","Y","3329RIdN",905.40000000000009]
["Amir","Manssour",41732,null,15,"Robin Hood Primary School","3329","Y","3329RIdN",905.40000000000009]
["Laveah","Simpson",41770,null,15,"Robin Hood Primary School","3329","Y","3329RIdN",905.40000000000009]
["Minae","Legore-Tomkins",41736,null,15,"The Nottingham Nursery School and Training Centre","1012","Y","1012KMdb",905.40000000000009]
["Alieu","Nyandou",41898,null,15,"The Nottingham Nursery School and Training Centre","1012","Y","1012KMdb",905.40000000000009]
["Zainab","El Hassan",42022,null,15,"The Nottingham Nursery School and Training Centre","1012","Y","1012KMdb",905.40000000000009]
["Mohammad","El Said",41919,null,15,"The Nottingham Nursery School and Training Centre","1012","Y","1012KMdb",905.40000000000009]
["Ayaan","Farooque",41934,null,15,"The Nottingham Nursery School and Training Centre","1012","Y","1012KMdb",905.40000000000009]
["Shanaya","Francis-Young",41740,null,15,"The Nottingham Nursery School and Training Centre","1012","Y","1012KMdb",905.40000000000009]
["Letisha","Hart",41990,null,15,"The Nottingham Nursery School and Training Centre","1012","Y","1012KMdb",905.40000000000009]
["Momina","Irfan",41989,null,15,"The Nottingham Nursery School and Training Centre","1012","Y","1012KMdb",905.40000000000009]
["Ridwan","Ishag",41958,null,15,"The Nottingham Nursery School and Training Centre","1012","Y","1012KMdb",905.40000000000009]
["Mai","Jammeh",41840,null,15,"The Nottingham Nursery School and Training Centre","1012","Y","1012KMdb",905.40000000000009]
["Tanka","Dlshad",41849,null,15,"The Nottingham Nursery School and Training Centre","1012","Y","1012KMdb",905.40000000000009]
["Filip","Kopacz",41751,null,15,"The Nottingham Nursery School and Training Centre","1012","Y","1012KMdb",905.40000000000009]
["Alannah","Dennis",41776,null,15,"The Nottingham Nursery School and Training Centre","1012","Y","1012KMdb",905.40000000000009]
["Ramiro","Macialek-Andrasz",41858,null,15,"The Nottingham Nursery School and Training Centre","1012","Y","1012KMdb",905.40000000000009]
["Hanna","Manowiecka",41923,null,15,"The Nottingham Nursery School and Training Centre","1012","Y","1012KMdb",905.40000000000009]
["Brayden","McDevitt",41949,null,15,"The Nottingham Nursery School and Training Centre","1012","Y","1012KMdb",905.40000000000009]
["Mohammed","Musa",41901,null,15,"The Nottingham Nursery School and Training Centre","1012","Y","1012KMdb",905.40000000000009]
["Mansoor","Zein",41756,null,15,"The Nottingham Nursery School and Training Centre","1012","Y","1012KMdb",905.40000000000009]
["Sessie","T-Glavee",41759,null,15,"The Nottingham Nursery School and Training Centre","1012","Y","1012KMdb",905.40000000000009]
["Ellie","Spencer",42041,null,15,"The Nottingham Nursery School and Training Centre","1012","Y","1012KMdb",905.40000000000009]
["Hannah","Sierzpowska",41905,null,15,"The Nottingham Nursery School and Training Centre","1012","Y","1012KMdb",905.40000000000009]
["Summer-Louise","Ramage",41816,null,15,"The Nottingham Nursery School and Training Centre","1012","Y","1012KMdb",905.40000000000009]
["Lawe","Kader",41927,null,15,"The Nottingham Nursery School and Training Centre","1012","Y","1012KMdb",905.40000000000009]
{"$rows_left_out":85}
{"sheet":"EY PP","index":4,"n_rows":79,"n_cols":6,"rows_kept":79,"cut":false,"hidden":true,"merged":[]}
["EY PP Summer Term"]
[null,null,null,null,"Rate",0.53]
[null,null,null,null,"Weeks",12]
["Acad/Main","Passcode","NativeID","SchoolName","Eligible Hours","Funding"]
["M","2045jcKb",8922045,"Bentinck Primary School",45,286]
["M","2006MAGL",8922006,"Berridge Primary School",105,668]
["A","3000JAIt",8923000,"BULWELL ST. MARYS C. OF E.",165,1049]
["A","2082fWlx",8922082,"BURFORD PRIMARY & NURSERY",75,477]
["M","2056bAuD",8922056,"CANTRELL PRIMARY",100,636]
["M","2057HOsi",8922057,"CARRINGTON PRIMARY SCHOOL",0,0]
["M","2894TISR",8922894,"Claremont Primary School",70,445]
["M","2153nWDQ",8922153,"Crabtree Farm Primary and Nursery School",495,3148]
["M","3323oqtU",8923323,"Dovecote Primary",150,954]
["M","2061xJcy",8922061,"Dunkirk Primary School",75,477]
["M","2016jnOu",8922016,"Fernwood Primary School",75,477]
["M","2929hDZn",8922929,"Forest Fields Primary School",120,763]
["M","2360ioBv",8922360,"Glade Hill Primary School",165,1049]
["M","3324xTCS",8923324,"Greenfields Community Primary",90,572]
["M","2163KqTk",8922163,"Haydn Primary School",135,859]
["M","2095dtuN",8922095,"HEATHFIELD PRIMARY & NURSERY SCHOOL",525,3339]
["M","2170MqVW",8922170,"Hempshill Hall Primary School",105,668]
["M","3328RPTm",8923328,"Henry Whipple Primary School",180,1145]
["M","2079FvIw",8922079,"MELBURY PRIMARY SCHOOL",255,1622]
["M","2158hMrS",8922158,"Mellers Primary and Nursery",105,668]
["M","2080tRdj",8922080,"Middleton Primary School",15,95]
["M","7042NwsN",8927042,"Oak Field School and Specialist Sports College",30,191]
["M","2151vOUw",8922151,"RISE PARK PRIMARY SCHOOL",240,1526]
["M","3329RIdN",8923329,"Robin Hood Primary School",225,1431]
["M","3332hTln",8923332,"Rufford Primary and Nursery",300,1908]
["A","2155CTPh",8922155,"Scotholme Primary School",135,859]
{"$rows_left_out":50}
{"sheet":"EYPP Pupils","index":5,"n_rows":869,"n_cols":8,"rows_kept":869,"cut":false,"hidden":false,"merged":[]}
[]
[null,{"$f":"+IF('Early Years Funding'!A7=\"\",\"\",LEFT('Early Years Funding'!A7,4))","v":""},{"$f":"+'Early Years Funding'!B7","v":""},{"$f":"+'Early Years Funding'!A7","v":0}]
[]
["Passcode","DFE","SCHOOL","NAME","DOB","HOURS/WEEK","SUMMER TERM HOURS","Summer Term EYPP"]
["3332hTln",3332,"Rufford","Shannaya Glover","2013-06-21",15,180,95.4]
["2003cUCo",2003,"St Augustine's","Emery Gordon-Buchanan","2013-05-13",15,180,95.4]
["2935BcLf",2935,"Whitegate Primary","Shaeyana Wynter","2013-04-09",15,180,95.4]
["2095dtuN",2095,"Heathfield","Quin Hoyland","2013-04-13",15,180,95.4]
["2011poYO",2011,"Djanogly Strelley","Ahmed Munir","2013-06-18",15,180,95.4]
["2157suKk",2157,"WELBECK PRIMARY SCHOOL","Muhammed Mustafa","2013-04-04",15,180,95.4]
["2190wUmX",2190,"Stanstead","Hope Booth","2013-06-29",15,180,95.4]
["2056bAuD",2056,"Cantrell","Faith Mead","2013-07-13",15,180,95.4]
["3331XVIS",3331,"St Ann's Well Academy","Keegan Begg","2013-06-21",15,180,95.4]
["2906DDOl",2906,"Milford","Dalton Fells","2013-07-10",15,180,95.4]
["2095dtuN",2095,"Heathfield","Paige Williams","2013-07-24",15,180,95.4]
["1012KMdb",1012,"The Nottingham Nursery School","Irmak Yokus","2013-05-11",15,180,95.4]
["2929hDZn",2929,"Forest Fields","Saliha Mahmood","2013-02-11",15,180,95.4]
["2155CTPh",2155,"Scotholme","Dezso Forgacs","2013-04-09",15,180,95.4]
["2110WEKx",2110,"Southwark","Thomas Bills","2013-01-16",15,180,95.4]
["2006MAGL",2006,"Berridge","Semiliano Mirga","2013-02-26",15,180,95.4]
["2907cNUj",2907,"Glapton","Anilah Smith","2013-06-13",15,180,95.4]
["3326cFKo",3326,"Southglade","Daniel Mohammadi","2013-08-06",15,180,95.4]
["2158hMrS",2158,"Mellers","Sutey Dibba Manka","2013-02-12",15,180,95.4]
["2013rLUm",2013,"Rosslyn Park Primary","Curtis Walters-Martin","2013-03-21",15,180,95.4]
["3326cFKo",3326,"Southglade","Laci-Leigh Hancock","2013-07-09",15,180,95.4]
["3326cFKo",3326,"Southglade","Kyraleigh McGrane","2013-08-01",15,180,95.4]
["2170MqVW",2170,"Hempshill Hall","Megan O'Hallaron","2013-05-13",15,180,95.4]
["2170MqVW",2170,"Hempshill Hall","Eboniah Plummer","2013-09-30",15,180,95.4]
["2003cUCo",2003,"St Augustine's","Simon Tesfahans","2014-02-28",15,180,95.4]
["2128wfAl",2128,"Southwold","Muhammad Butt","2012-10-11",15,180,95.4]
{"$rows_left_out":839}