{"text_format":"1","workbook":"xlsx","n_sheets":7,"sheets":["Early Years Funding","DAF","3&4","Adj indicative","2 YO","EY PP","EYPP Pupils"],"not_rendered":{"charts":0,"images":1,"macros":1,"external_links":1,"defined_names":6,"comments":0,"pivot_tables":0},"unopened":[],"bounds":{"document_bytes":16777216,"sheet_cells":100000,"rows_first":2000,"rows_last":500,"rows_between":2000,"halvings":0,"cell_chars":16384,"cell_head_chars":4096},"cells_cut":0,"cells_raw":0,"read":"whole","date_system":"1900"}

{"sheet":"Early Years Funding","index":0,"n_rows":33,"n_cols":11,"rows_kept":33,"cut":false,"hidden":false,"merged":[[6,1,6,10],[8,9,8,10],[8,6,8,7],[8,0,8,1],[8,3,8,4]]}
[]
[]
[]
[]
["Early Years Funding - Spring Term Final"]
[]
[null,{"$f":"+IF(A7=\"\",\"\",VLOOKUP(A7,'3&4'!A3:C76,3,FALSE))","v":""}]
[{"$f":"IF(A7=\"\",\"Please enter you 8 digit passcode in the blue box above\",\"\")","v":"Please enter you 8 digit passcode in the blue box above"}]
["3 & 4 Year Old Funding",null,null,"Disability Access Fund",null,null,"2 Year Old Funding",null,null,"Early Years Pupil Premium"]
[]
["Base Rate",4.25,null,"Annual Value",615,null,"Hourly Rate",{"$f":"+'2 YO'!K1","v":5.03},null,"Hourly Rate",{"$f":"+'EY PP'!F2","v":0.53}]
[]
["Estimated Funded Hours",{"$f":"+IF(ISNA(VLOOKUP($A$7,'Adj indicative'!A$1:S$83,18,FALSE)),0,VLOOKUP($A$7,'Adj indicative'!A$1:S$83,18,FALSE))+IF(ISNA(VLOOKUP($A$7,'Adj indicative'!A$1:S$83,19,FALSE)),0,VLOOKUP($A$7,'Adj indicative'!A$1:S$83,19,FALSE))","v":0},null,null,null,null,"Weekly Funded Hours",{"$f":"+SUMIFS('2 YO'!$H$2:$H$41,'2 YO'!$I$2:$I$41,\"Y\",'2 YO'!$J$2:$J$41,A7)","v":0},null,"Weekly Funded Hours",{"$f":"+IF(ISNA(VLOOKUP(A7,'EY PP'!$B$5:$F$72,4,FALSE)),0,VLOOKUP(A7,'EY PP'!$B$5:$F$72,4,FALSE))","v":0}]
["Estimated Base Rate Funding",{"$f":"+B13*B11","v":0},null,"Number of children",{"$f":"+IF(ISNA(VLOOKUP($A$7,DAF!A$3:D$3,4,FALSE)),0,VLOOKUP($A$7,DAF!A$3:D$3,4,FALSE))","v":0},null,"Funded Weeks",12,null,"Funded Weeks",12]
["Estimated Deprivation Funding",{"$f":"+IF(ISNA(VLOOKUP($A$7,'Adj indicative'!A$1:AP$83,41,FALSE)),0,VLOOKUP($A$7,'Adj indicative'!A$1:AP$83,41,FALSE))+IF(ISNA(VLOOKUP($A$7,'Adj indicative'!A$1:AP$83,42,FALSE)),0,VLOOKUP($A$7,'Adj indicative'!A$1:AP$83,42,FALSE))","v":0}]
["75% Spring Initial Payment",{"$f":"SUM(B14+B15)*0.75","v":0}]
[]
["Actual Funded Universal Hours",{"$f":"+IF(ISNA(VLOOKUP($A$7,'3&4'!$A$2:$Q$76,5,FALSE)),0,VLOOKUP($A$7,'3&4'!$A$2:$Q$76,5,FALSE))*12","v":0}]
["Actual Funded Extended Hours",{"$f":"+IF(ISNA(VLOOKUP($A$7,'3&4'!$A$2:$Q$76,6,FALSE)),0,VLOOKUP($A$7,'3&4'!$A$2:$Q$76,6,FALSE))*12","v":0}]
["Actual Funded Hours",{"$f":"+IF(ISNA(VLOOKUP($A$7,'3&4'!$A$2:$Q$76,9,FALSE)),0,VLOOKUP($A$7,'3&4'!$A$2:$Q$76,9,FALSE))","v":0}]
[]
["Actual Base Rate Funding",{"$f":"B20*B11","v":0}]
["Actual Deprivation Funding",{"$f":"+IF(ISNA(VLOOKUP($A$7,'3&4'!$A$1:$Q$76,10,FALSE)),0,VLOOKUP($A$7,'3&4'!$A$1:$Q$76,10,FALSE))","v":0}]
["Spring Term Final Funding",{"$f":"SUM(B22+B23)","v":0}]
[]
["Spring Term Final Adjustment",{"$f":"+B24-B16","v":0},null,"Spring Term Funding",{"$f":"E11*E14","v":0},null,"Spring Term Funding",{"$f":"+H13*H14*H11","v":0},null,"Spring Term Funding",{"$f":"+K13*K14*K11","v":0}]
[]
["Payment",{"$f":"IF(B26+B27>0,B26+B27,0)","v":0}]
[]
["Notes:"]
{"$rows_left_out":4}
{"sheet":"DAF","index":1,"n_rows":3,"n_cols":5,"rows_kept":3,"cut":false,"hidden":true,"merged":[]}
["DAF"]
[]
["2939eDdn",2939,"Huntingdon Academy",1,615]

{"sheet":"3&4","index":2,"n_rows":78,"n_cols":17,"rows_kept":78,"cut":false,"hidden":true,"merged":[]}
[null,null,null,"Weeks",12]
["Passcode","DFE","School Name","Status","Jan Census Weekly Hours (funded hours)","Jan Census Extended (with code)","Jan Census Weekly Hours (Hours at setting)","Hours not funded","Spring Term Funded Hours","Deprivation","Base Rate","Spring Term Funding","Estimated Spring Term Funding","Variance actual v est","Maintained Schools Budget Share Adjustments","75% Academies Initial Spring payment based on indicitive","Academies Final Payment"]
["2045jcKb",2045,"Bentinck Primary and Nursery School","Null",555,75,675,45,7560,1080,32130,33210,28170,5040,5040,"NA","NA"]
["2006MAGL",2006,"Berridge Primary","Null",1080,0,1080,0,12960,1440,55080,56520,69075,-12555,-12555,"NA","NA"]
["2056bAuD",2056,"Cantrell Primary and Nursery School","Null",687.5,270,957.5,0,11490,1140,48832.5,49972.5,52020,-2047.5,-2048,"NA","NA"]
["2057HOsi",2057,"Carrington Primary and Nursery School","Null",390,90,519,39,5760,360,24480,24840,21780,3060,3060,"NA","NA"]
["2894TISR",2894,"Claremont Primary and Nursery School","Null",525,0,525,0,6300,180,26775,26955,24795,2160,2160,"NA","NA"]
["2153nWDQ",2153,"Crab Tree Farm Primary","Null",735,0,735,0,8820,4140,37485,41625,52605,-10980,-10980,"NA","NA"]
["3323oqtU",3323,"Dovecote Primary and Nursery School","Null",840,105,945,0,11340,1980,48195,50175,42120,8055,8055,"NA","NA"]
["2061xJcy",2061,"Dunkirk Primary and Nursery School","Null",285,15,300,0,3600,360,15300,15660,25965,-10305,-10305,"NA","NA"]
["2016jnOu",2016,"Fernwood Primary (was Infants)","Null",1155,390,1545,0,18540,1080,78795,79875,80460,-585,-585,"NA","NA"]
["2929hDZn",2929,"Forest Fields Primary and Nursery School","Null",840,15,855,0,10260,1620,43605,45225,35865,9360,9360,"NA","NA"]
["2360ioBv",2360,"Glade Hill Primary School","Null",705,135,894,54,10080,2340,42840,45180,29160,16020,16020,"NA","NA"]
["3324xTCS",3324,"Greenfields Community School","Null",435,45,750,270,5760,1800,24480,26280,29700,-3420,-3420,"NA","NA"]
["2163KqTk",2163,"Haydn Primary School","Null",780,210,990,0,11880,1260,50490,51750,54630,-2880,-2880,"NA","NA"]
["2095dtuN",2095,"Heathfield Primary and Nursery School","Null",1125,165,1290,0,15480,6300,65790,72090,45180,26910,26910,"NA","NA"]
["2170MqVW",2170,"Hempshill Hall Primary School","Null",660,0,660,0,7920,900,33660,34560,43875,-9315,-9315,"NA","NA"]
["3328RPTm",3328,"Henry Whipple Primary School","Null",405,75,555,75,5760,1980,24480,26460,22455,4005,4005,"NA","NA"]
["2079FvIw",2079,"Melbury Primary School","Null",300,0,300,0,3600,1260,15300,16560,27225,-10665,-10665,"NA","NA"]
["2158hMrS",2158,"Mellers Primary and Nursery School","Null",780,30,1185,375,9720,2880,41310,44190,23985,20205,20205,"NA","NA"]
["2080tRdj",2080,"Middleton Primary and Nursery School","Null",1080,0,1080,0,12960,0,55080,55080,42615,12465,12465,"NA","NA"]
["7042NwsN",7042,"Oak Field School","Null",0,0,0,0,0,0,0,0,0,0,0,"NA","NA"]
["2151vOUw",2151,"Rise Park Primary and Nursery School","Null",855,420,1320,45,15300,1800,65025,66825,48825,18000,18000,"NA","NA"]
["3329RIdN",3329,"Robin Hood Primary School","Null",1080,255,1335,0,16020,900,68085,68985,63090,5895,5895,"NA","NA"]
["3332hTln",3332,"Rufford Primary School","Null",690,0,690,0,8280,4140,35190,39330,33660,5670,5670,"NA","NA"]
["2007acGn",2007,"Seely Primary","Null",690,60,765,15,9000,1260,38250,39510,51840,-12330,-12330,"NA","NA"]
["2897xXHv",2897,"Snape Wood Primary and Nursery School","Null",405,75,510,30,5760,2340,24480,26820,36495,-9675,-9675,"NA","NA"]
["3326cFKo",3326,"Southglade Primary School","Null",780,75,1455,600,10260,3600,43605,47205,45315,1890,1890,"NA","NA"]
["2128wfAl",2128,"Southwold Primary School and Early Years' Centre","Null",480,45,930,405,6300,1980,26775,28755,20205,8550,8550,"NA","NA"]
["1012KMdb",1012,"The Nottingham Nursery School","Null",1080,255,1365,30,16020,3600,68085,71685,62550,9135,9135,"NA","NA"]
{"$rows_left_out":49}
{"sheet":"Adj indicative","index":3,"n_rows":96,"n_cols":47,"rows_kept":96,"cut":false,"hidden":true,"merged":[[3,13,3,14],[3,3,3,4],[3,5,3,6],[3,7,3,8],[3,9,3,10],[3,11,3,12],[2,38,2,42],[3,15,3,16],[3,17,3,18],[3,19,3,20],[3,21,3,22],[2,3,2,8],[2,9,2,14],[2,15,2,20],[2,28,2,32],[2,33,2,37]]}
[null,null,null,"Indicative EY Base rate funding 2017/18",null,null,null,null,null,null,null,null,null,null,null,null,null,null,null,null,null,null,null,null,null,null,null,null,"Indicative EY Deprivation Funding 2017/18"]
[]
[null,null,null,"SUMMER TERM 2016",null,null,null,null,null,"AUTUMN TERM 2016",null,null,null,null,null,"SPRING TERM 2016",null,null,null,null,null,null,null,null,null,null,null,null,"SUMMER TERM",null,null,null,null,"AUTUMN TERM",null,null,null,null,"SPRING TERM"]
[null,null,null,"Number of Children Accessing",null,"Total Funded hours",null,"Indicative Base rate funding",null,"Number of Children Accessing",null,"Total Funded hours",null,"Indicative Base rate funding",null,"Number of Children Accessing",null,"Total Funded hours",null,"Indicative Base rate funding",null,"Total Indicative 2017/18 Base rate funding",null,null,null,null,45,null,"Estimate eligible EYPP children accessing",null,"Deprivation funding",null,null,"Estimate eligible EYPP children accessing",null,"Deprivation Funding",null,null,"Estimate eligible EYPP children accessing",null,"Deprivation Funding",null,null,"Total Indicative 2017/18 Deprivation funding"]
["Passcode","DfE","School","Universal 15 hour entitlement","Local additional hours","Universal 15 hour entitlement","Local additional hours","Universal 15 hour entitlement","Local additional hours","Universal 15 hour entitlement","National additional entitlement for working parents","Universal 15 hour entitlement","National additional entitlement for working parents","Universal 15 hour entitlement","National additional entitlement for working parents","Universal 15 hour entitlement","National additional entitlement for working parents","Universal 15 hour entitlement","National additional entitlement for working parents","Universal 15 hour entitlement","National additional entitlement for working parents","Universal 15 hour entitlement","Additional hours",null,"Passcode","DfE","School","Assumed % pupils eligible for EYPP","Universal 15 hour entitlement only","Local additional hours","Universal 15 hour entitlement hours","Local additional hours","EYPP","Universal 15 hour entitlement","National additional entitlement for working parents","Universal 15 hour entitlement hours","National additional entitlement hours for working parents","EYPP","Universal 15 hour entitlement","National additional entitlement for working parents","Universal 15 hour entitlement hours","National additional entitlement hours for working parents","EYPP","Universal 15 hour entitlement hours","Additional hours","EYPP"]
["2002riNz",2002,"AMBLESIDE PRIMARY SCHOOL",141,0,25380,0,107865,0,82,null,17220,0,73185,0,120,null,21600,0,91800,0,272850,0,null,"2002riNz",2002,"AMBLESIDE PRIMARY SCHOOL",0.321656050955414,45,0,8100,0,4293,26,0,5460,0,2893.8,39,0,7020,0,3720.6000000000004,20580,0,10907.400000000001,0]
["2045jcKb",2045,"Bentinck Primary School",34,17,6120,2040,26010,8670,24,null,5040,0,21420,0,34,null,6120,0,26010,0,73440,8670,null,"2045jcKb",2045,"Bentinck Primary School",0.34466019417475702,12,6,2160,720,1144.8,8,0,1680,0,890.40000000000009,12,0,2160,0,1144.8,6000,720,3180,0]
["2006MAGL",2006,"Berridge Primary School",111,0,19980,0,84915,0,60,null,12600,0,53550,0,87,null,15660,0,66555,0,205020,0,null,"2006MAGL",2006,"Berridge Primary School",0.16260162601625999,18,0,3240,0,1717.2,10,0,2100,0,1113,14,0,2520,0,1335.6000000000001,7860,0,4165.8,0]
["3319QBOK",3319,"Blessed Robert Widmerpool Catholic Voluntary Academy",59,0,10620,0,45135,0,42,null,8820,0,37485,0,51,null,9180,0,39015,0,121635,0,null,"3319QBOK",3319,"Blessed Robert Widmerpool Catholic Voluntary Academy",4.1095890410958902E-2,2,0,360,0,190.8,2,0,420,0,222.60000000000002,2,0,360,0,190.8,1140,0,604.20000000000005,0]
["2183JqYY",2183,"BLUE BELL HILL PRIMARY SCHOOL",66,0,11880,0,50490,0,55,null,11550,0,49087.5,0,59,null,10620,0,45135,0,144712.5,0,null,"2183JqYY",2183,"BLUE BELL HILL PRIMARY SCHOOL",0.30272952853598001,20,0,3600,0,1908,17,0,3570,0,1892.1000000000001,18,0,3240,0,1717.2,10410,0,5517.3,0]
["4615dHTk",4615,"BLUECOAT ACADEMY",0,0,0,0,0,0,26,null,5460,0,23205,0,null,null,null,null,null,null,null,null,null,"4615dHTk",4615,"BLUECOAT ACADEMY",0.182352941176471,0,0,0,0,0,5,0,1050,0,556.5,null,null,null,null,null,{"$f":"AJ11","v":1050},0,{"$f":"AL11","v":556.5},0]
["2019Xnfp",2019,"Bluecoat Primary Academy",null,null,null,null,null,null,null,null,null,null,null,null,26,null,4680,0,19890,0,43095,0,null,"2019Xnfp",2019,"Bluecoat Primary Academy",0.182352941176471,null,null,null,null,null,null,null,null,null,null,5,0,900,0,477,{"$f":"AO12","v":900},null,{"$f":"AO12","v":900}]
["2014sKZl",2014,"Brocklewood Primary School",79,0,14220,0,60435,0,46,null,9660,0,41055,0,61,null,10980,0,46665,0,148155,0,null,"2014sKZl",2014,"Brocklewood Primary School",0.44088176352705399,35,0,6300,0,3339,20,0,4200,0,2226,27,0,4860,0,2575.8000000000002,15360,0,8140.8,0]
["3000JAIt",3000,"BULWELL ST. MARYS C. OF E.",36,12,5940,1440,25245,6120,27,null,5670,0,24097.5,0,33,null,5940,0,25245,0,74587.5,6120,null,"3000JAIt",3000,"BULWELL ST. MARYS C. OF E.",0.30584192439862501,11,4,1980,480,1049.4000000000001,8,0,1680,0,890.40000000000009,10,0,1800,0,954,5460,480,2893.8,0]
["2082fWlx",2082,"BURFORD PRIMARY & NURSERY",48,0,8640,0,36720,0,22,null,4620,0,19635,0,38,null,6840,0,29070,0,85425,0,null,"2082fWlx",2082,"BURFORD PRIMARY & NURSERY",0.29951690821256,14,0,2520,0,1335.6000000000001,7,0,1470,0,779.1,11,0,1980,0,1049.4000000000001,5970,0,3164.1000000000004,0]
["2056bAuD",2056,"Cantrell Primary & Nurs",70,0,11460,0,48705,0,34,null,7140,0,30345,0,64,null,11520,0,48960,0,128010,0,null,"2056bAuD",2056,"Cantrell Primary & Nurs",0.26491646778042999,19,0,3420,0,1812.6000000000001,9,0,1890,0,1001.7,17,0,3060,0,1621.8000000000002,8370,0,4436.1000000000004,0]
["2057HOsi",2057,"Carrington Pri & Nurs",31,17,5580,1980,23715,8415,17,null,3570,0,15172.5,0,28,null,5040,0,21420,0,60307.5,8415,null,"2057HOsi",2057,"Carrington Pri & Nurs",7.7669902912621394E-2,2,1,360,120,190.8,1,0,210,0,111.30000000000001,2,0,360,0,190.8,930,120,492.90000000000003,0]
["2894TISR",2894,"Claremont Primary School",39,26,6630,3120,28177.5,13260,27,null,5670,0,24097.5,0,31,null,5580,0,23715,0,75990,13260,null,"2894TISR",2894,"Claremont Primary School",0.206632653061224,8,5,1440,600,763.2,6,0,1260,0,667.80000000000007,6,0,1080,0,572.4,3780,600,2003.4,0]
["2153nWDQ",2153,"Crabtree Farm Primary",73,0,13140,0,55845,0,50,null,10500,0,44625,0,61,null,10980,0,46665,0,147135,0,null,"2153nWDQ",2153,"Crabtree Farm Primary",0.53865336658354102,39,0,7020,0,3720.6000000000004,27,0,5670,0,3005.1000000000004,33,0,5940,0,3148.2000000000003,18630,0,9873.9000000000015,0]
["2081LkKD",2081,"Djanogly Northgate Academy",71,0,12780,0,54315,0,51,null,10710,0,45517.5,0,54,null,9720,0,41310,0,141142.5,0,null,"2081LkKD",2081,"Djanogly Northgate Academy",0.25441696113074203,18,0,3240,0,1717.2,13,0,2730,0,1446.9,14,0,2520,0,1335.6000000000001,8490,0,4499.7000000000007,0]
["2011poYO",2011,"Djanogly Strelley Academy",60,0,10800,0,45900,0,37,null,7770,0,33022.5,0,50,null,9000,0,38250,0,117172.5,0,null,"2011poYO",2011,"Djanogly Strelley Academy",0.44358974358974401,27,0,4860,0,2575.8000000000002,16,0,3360,0,1780.8000000000002,22,0,3960,0,2098.8000000000002,12180,0,6455.4000000000005,0]
["3323oqtU",3323,"Dovecote Primary",79,0,13620,0,57885,0,55,null,11550,0,49087.5,0,52,null,9360,0,39780,0,146752.5,0,null,"3323oqtU",3323,"Dovecote Primary",0.24937027707808601,20,0,3600,0,1908,14,0,2940,0,1558.2,13,0,2340,0,1240.2,8880,0,4706.3999999999996,0]
["2061xJcy",2061,"Dunkirk Primary School",40,14,7200,1680,30600,7140,32,null,6720,0,28560,0,33,null,5940,0,25245,0,84405,7140,null,"2061xJcy",2061,"Dunkirk Primary School",0.12254901960784299,5,2,900,240,477,4,0,840,0,445.20000000000005,4,0,720,0,381.6,2460,240,1303.8000000000002,0]
["2099WTff",2099,"Edale Rise Primary and Nursery",48,0,8640,0,36720,0,35,null,7350,0,31237.5,0,43,null,7740,0,32895,0,100852.5,0,null,"2099WTff",2099,"Edale Rise Primary and Nursery",0.28431372549019601,14,0,2520,0,1335.6000000000001,10,0,2100,0,1113,12,0,2160,0,1144.8,6780,0,3593.4000000000005,0]
["2074hvrt",2074,"Edna G Olds Academy",47,20,8460,2400,35955,10200,30,null,6300,0,26775,0,39,null,7020,0,29835,0,92565,10200,null,"2074hvrt",2074,"Edna G Olds Academy",0.27500000000000002,13,6,2340,720,1240.2,8,0,1680,0,890.40000000000009,11,0,1980,0,1049.4000000000001,6000,720,3180.0000000000005,0]
["2016jnOu",2016,"Fernwood Primary School",104,0,18720,0,79560,0,104,null,21840,0,92820,0,104,null,18720,0,79560,0,251940,0,null,"2016jnOu",2016,"Fernwood Primary School",4.8206278026905802E-2,5,0,900,0,477,5,0,1050,0,556.5,5,0,900,0,477,2850,0,1510.5,0]
["2005HQuH",2005,"Firbeck Academy",37,23,6624,1956,28152,8313,35,null,7350,0,31237.5,0,31,null,5580,0,23715,0,83104.5,8313,null,"2005HQuH",2005,"Firbeck Academy",0.25123152709359597,9,6,1620,720,858.6,9,0,1890,0,1001.7,8,0,1440,0,763.2,4950,720,2623.5,0]
["2929hDZn",2929,"Forest Fields Primary School",58,46,10080,5520,42840,23460,50,null,10500,0,44625,0,45,null,8100,0,34425,0,121890,23460,null,"2929hDZn",2929,"Forest Fields Primary School",0.16945996275605199,10,8,1800,960,954,8,0,1680,0,890.40000000000009,8,0,1440,0,763.2,4920,960,2607.6000000000004,0]
["2360ioBv",2360,"Glade Hill Primary School",52,32,9360,2352,39780,9996,34,null,7140,0,30345,0,36,null,6480,0,27540,0,97665,9996,null,"2360ioBv",2360,"Glade Hill Primary School",0.25,13,8,2340,960,1240.2,9,0,1890,0,1001.7,9,0,1620,0,858.6,5850,960,3100.5,0]
["2009jKrj",2009,"Glenbrook Primary",26,18,4680,2160,19890,9180,19,null,3990,0,16957.5,0,25,null,4500,0,19125,0,55972.5,9180,null,"2009jKrj",2009,"Glenbrook Primary",0.41666666666666702,11,8,1980,960,1049.4000000000001,8,0,1680,0,890.40000000000009,10,0,1800,0,954,5460,960,2893.8,0]
{"$rows_left_out":67}
{"sheet":"2 YO","index":4,"n_rows":43,"n_cols":11,"rows_kept":43,"cut":false,"hidden":true,"merged":[]}
["NativeID","SchoolName","Surname","Forename","UPN","DoB","Eligibile:","Hours: ","ELIGIBLE FOR ELP  YES/NO","School code",5.03]
[8922074,"Edna G Olds Academy","Hussain","Aizah",null,"27/02/2015 00:00:00","Y",15,"Y","2074hvrt",905.40000000000009]
[8922081,"Djanogly Northgate Academy","Abdullah","Muhammad",null,"22/04/2015 00:00:00","Y",15,"Y","2081LkKD",905.40000000000009]
[8922081,"Djanogly Northgate Academy","Obed","Purity",null,"30/04/2015 00:00:00","Y",15,"Y","2081LkKD",905.40000000000009]
[8922081,"Djanogly Northgate Academy","Pleasance-Brereton","Lilah-Mae",null,"16/10/2015 00:00:00","Y",15,"Y","2081LkKD",905.40000000000009]
[8922081,"Djanogly Northgate Academy","Kaye","Chelsea",null,"2015-05-01","Y",15,"Y","2081LkKD",905.40000000000009]
[8922081,"Djanogly Northgate Academy","Maveso","Eric",null,"16/02/2015 00:00:00","Y",15,"Y","2081LkKD",905.40000000000009]
[8922081,"Djanogly Northgate Academy","May-Wood","Alyssia",null,"14/04/2015 00:00:00","Y",15,"Y","2081LkKD",905.40000000000009]
[8922081,"Djanogly Northgate Academy","Lee","Layla",null,"23/05/2015 00:00:00","Y",15,"Y","2081LkKD",905.40000000000009]
[8922081,"Djanogly Northgate Academy","Laws-King","Jenson-James",null,"14/08/2015 00:00:00","Y",15,"Y","2081LkKD",905.40000000000009]
[8922118,"Whitemoor Academy","Haines","Tyler",null,"2015-03-01","Y",15,"Y","2118jGMU",905.40000000000009]
[8922906,"Milford Academy","Parker","Isaiah",null,"22/05/2015 00:00:00","Y",15,"Y","2906DDOl",905.40000000000009]
[8922906,"Milford Academy","Pridgeon","Amila",null,"27/02/2015 00:00:00","Y",15,"Y","2906DDOl",905.40000000000009]
[8922906,"Milford Academy","Morris","Madison",null,"2015-05-02","Y",15,"Y","2906DDOl",905.40000000000009]
[8922906,"Milford Academy","Shaw","Bai",null,"17/01/2015 00:00:00","Y",15,"Y","2906DDOl",905.40000000000009]
[8922906,"Milford Academy","Suffield","Gracie-Leigh",null,"22/05/2015 00:00:00","Y",15,"Y","2906DDOl",905.40000000000009]
[8922906,"Milford Academy","Tinsley","Caden",null,"16/02/2015 00:00:00","Y",15,"Y","2906DDOl",905.40000000000009]
[8922906,"Milford Academy","Gunn-Robb","Joey",null,"15/10/2015 00:00:00","Y",15,"Y","2906DDOl",905.40000000000009]
[8922906,"Milford Academy","Caesar-Roulstone","Takayah",null,"2015-09-09","Y",15,"Y","2906DDOl",905.40000000000009]
[8922906,"Milford Academy","Delappe","Oliver",null,"27/09/2015 00:00:00","Y",15,"Y","2906DDOl",905.40000000000009]
[8923000,"Bulwell St Mary's Primary and Nursery School","Newberry","Riley",null,"2015-04-01","Y",15,"Y","3000JAIt",905.40000000000009]
[8923330,"Sycamore Academy","AHMED","Vienna",null,"30/01/2015 00:00:00","Y",15,"Y","3330JXZI",905.40000000000009]
[8923330,"Sycamore Academy","AMINI","Nazila",null,"2015-01-01","Y",15,"Y","3330JXZI",905.40000000000009]
[8923330,"Sycamore Academy","ALI","Ada",null,"2015-09-08","Y",15,"Y","3330JXZI",905.40000000000009]
[8923330,"Sycamore Academy","ALI","Cheya",null,"17/07/2015 00:00:00","Y",15,"Y","3330JXZI",905.40000000000009]
[8923330,"Sycamore Academy","ABABAKER","Lass",null,"13/11/2015 00:00:00","Y",15,"Y","3330JXZI",905.40000000000009]
[8923330,"Sycamore Academy","HOLROYD WILSON","Christopher",null,"23/09/2015 00:00:00","Y",15,"Y","3330JXZI",905.40000000000009]
[8923330,"Sycamore Academy","HUSSEIN","Ali",null,"2015-04-08","Y",15,"Y","3330JXZI",905.40000000000009]
[8923330,"Sycamore Academy","HILL FAIRHURST","Harvey",null,"2015-03-06","Y",15,"Y","3330JXZI",905.40000000000009]
[8923330,"Sycamore Academy","HIGHTON YORKE","Lilly May",null,"2015-07-07","Y",15,"Y","3330JXZI",905.40000000000009]
{"$rows_left_out":14}
{"sheet":"EY PP","index":5,"n_rows":79,"n_cols":6,"rows_kept":79,"cut":false,"hidden":true,"merged":[]}
["EY PP Spring Term",null,null,"EY PP Spring Term"]
[null,null,null,null,"Rate",0.53]
[null,null,null,null,"Weeks",12]
["Acad/Main","Passcode","NativeID","SchoolName","Eligible Hours","Funding"]
["M","2045jcKb",8922045,"Bentinck Primary School",90,572]
["M","2006MAGL",8922006,"Berridge Primary School",120,763]
["M","2056bAuD",8922056,"CANTRELL PRIMARY",95,604]
["M","2057HOsi",8922057,"CARRINGTON PRIMARY SCHOOL",30,191]
["M","2894TISR",8922894,"Claremont Primary School",15,95]
["M","2153nWDQ",8922153,"Crabtree Farm Primary and Nursery School",345,2194]
["M","3323oqtU",8923323,"Dovecote Primary",165,1049]
["M","2061xJcy",8922061,"Dunkirk Primary School",30,191]
["M","2016jnOu",8922016,"Fernwood Primary School",75,477]
["M","2929hDZn",8922929,"Forest Fields Primary School",135,859]
["M","2360ioBv",8922360,"Glade Hill Primary School",195,1240]
["M","3324xTCS",8923324,"Greenfields Community Primary",150,954]
["M","2163KqTk",8922163,"Haydn Primary School",90,572]
["M","2095dtuN",8922095,"HEATHFIELD PRIMARY & NURSERY SCHOOL",510,3244]
["M","2170MqVW",8922170,"Hempshill Hall Primary School",75,477]
["M","3328RPTm",8923328,"Henry Whipple Primary School",165,1049]
["M","2079FvIw",8922079,"MELBURY PRIMARY SCHOOL",105,668]
["M","2158hMrS",8922158,"Mellers Primary and Nursery",240,1526]
["M","2080tRdj",8922080,"Middleton Primary School",0,0]
["M","7042NwsN",8927042,"Oak Field School and Specialist Sports College",15,95]
["M","2151vOUw",8922151,"RISE PARK PRIMARY SCHOOL",135,859]
["M","3329RIdN",8923329,"Robin Hood Primary School",75,477]
["M","3332hTln",8923332,"Rufford Primary and Nursery",345,2194]
["M","2007acGn",8922007,"Seely Primary School",105,668]
["M","2897xXHv",8922897,"Snape Wood Primary School",180,1145]
["M","3326cFKo",8923326,"Southglade Primary School",300,1908]
{"$rows_left_out":50}
{"sheet":"EYPP Pupils","index":6,"n_rows":805,"n_cols":8,"rows_kept":805,"cut":false,"hidden":false,"merged":[]}
[]
[null,{"$f":"+IF('Early Years Funding'!A7=\"\",\"\",LEFT('Early Years Funding'!A7,4))","v":""},{"$f":"+'Early Years Funding'!B7","v":""},{"$f":"+'Early Years Funding'!A7","v":0}]
[]
["Passcode","DFE","SCHOOL","NAME","DOB","HOURS/WEEK","Spring TERM HOURS","Spring Term EYPP"]
["2002riNz",2002,"AMBLESIDE PRIMARY SCHOOL","Ali Mohammed","2014-01-19",15,180,95.4]
["2002riNz",2002,"AMBLESIDE PRIMARY SCHOOL","Anderson Isaac","2013-10-05",15,180,95.4]
["2002riNz",2002,"AMBLESIDE PRIMARY SCHOOL","Aziz Jamal","2014-06-24",15,180,95.4]
["2002riNz",2002,"AMBLESIDE PRIMARY SCHOOL","Bentley Amie-Leigh","2014-02-08",15,180,95.4]
["2002riNz",2002,"AMBLESIDE PRIMARY SCHOOL","Betton Frayah","2014-06-23",15,180,95.4]
["2002riNz",2002,"AMBLESIDE PRIMARY SCHOOL","Birch Parkinson Emily","2014-05-14",15,180,95.4]
["2002riNz",2002,"AMBLESIDE PRIMARY SCHOOL","Carter Brody","2014-05-10",15,180,95.4]
["2002riNz",2002,"AMBLESIDE PRIMARY SCHOOL","Carter Ellie-Mae","2013-10-02",15,180,95.4]
["2002riNz",2002,"AMBLESIDE PRIMARY SCHOOL","Claxton Mckenzie","2014-04-01",15,180,95.4]
["2002riNz",2002,"AMBLESIDE PRIMARY SCHOOL","Daley Kaziar","2013-10-03",15,180,95.4]
["2002riNz",2002,"AMBLESIDE PRIMARY SCHOOL","Douglas-Hunt Remi-Mae","2014-01-13",15,180,95.4]
["2002riNz",2002,"AMBLESIDE PRIMARY SCHOOL","England Libby-Grace","2014-11-15",15,180,95.4]
["2002riNz",2002,"AMBLESIDE PRIMARY SCHOOL","Froggatt Sienna","2014-12-06",15,180,95.4]
["2002riNz",2002,"AMBLESIDE PRIMARY SCHOOL","Greaves Jack","2014-03-03",15,180,95.4]
["2002riNz",2002,"AMBLESIDE PRIMARY SCHOOL","Hepburn Harlie","2014-02-02",15,180,95.4]
["2002riNz",2002,"AMBLESIDE PRIMARY SCHOOL","Khan Malaika","2014-01-05",15,180,95.4]
["2002riNz",2002,"AMBLESIDE PRIMARY SCHOOL","Lynn Lacey","2014-11-27",15,180,95.4]
["2002riNz",2002,"AMBLESIDE PRIMARY SCHOOL","Martin Ryley-James","2014-07-14",15,180,95.4]
["2002riNz",2002,"AMBLESIDE PRIMARY SCHOOL","McClean Theo","2014-07-25",15,180,95.4]
["2002riNz",2002,"AMBLESIDE PRIMARY SCHOOL","Mehmet Ruya","2014-04-22",15,180,95.4]
["2002riNz",2002,"AMBLESIDE PRIMARY SCHOOL","Mejeh Patrick","2014-05-09",15,180,95.4]
["2002riNz",2002,"AMBLESIDE PRIMARY SCHOOL","Metcalfe Alyscia","2014-06-28",15,180,95.4]
["2002riNz",2002,"AMBLESIDE PRIMARY SCHOOL","Oakley Mia","2014-03-21",15,180,95.4]
["2002riNz",2002,"AMBLESIDE PRIMARY SCHOOL","Olejarz Irmina","2014-01-22",15,180,95.4]
["2002riNz",2002,"AMBLESIDE PRIMARY SCHOOL","Osman Macy-Jai","2014-10-31",15,180,95.4]
["2002riNz",2002,"AMBLESIDE PRIMARY SCHOOL","Powell Thyla","2014-02-15",15,180,95.4]
{"$rows_left_out":775}