{"text_format":"1","workbook":"xlsx","n_sheets":7,"sheets":["Early Years Funding","DAf","3&4","Adj Indicative","2 YO","EY PP","EYPP Pupils"],"not_rendered":{"charts":0,"images":1,"macros":1,"external_links":0,"defined_names":6,"comments":0,"pivot_tables":0},"unopened":[],"bounds":{"document_bytes":16777216,"sheet_cells":100000,"rows_first":2000,"rows_last":500,"rows_between":2000,"halvings":0,"cell_chars":16384,"cell_head_chars":4096},"cells_cut":0,"cells_raw":0,"read":"whole","date_system":"1900"}

{"sheet":"Early Years Funding","index":0,"n_rows":39,"n_cols":11,"rows_kept":39,"cut":false,"hidden":false,"merged":[[6,1,6,10],[8,9,8,10],[8,6,8,7],[8,0,8,1],[35,0,36,10],[8,3,8,4]]}
[]
[]
[]
[]
["Early Years Funding - Autumn Term Final"]
[]
[null,{"$f":"+IF(A7=\"\",\"Please enter your 8 digit passcode in the blue box\",VLOOKUP(A7,'3&4'!A3:C75,3,FALSE))","v":"Please enter your 8 digit passcode in the blue box"}]
[]
["3 & 4 Year Old Funding",null,null,"Disability Access Fund",null,null,"2 Year Olds",null,null,"Early Years Pupil Premium"]
[]
["Base Rate",4.25,null,"Annual Value",615,null,"Weekly Funded Hours",{"$f":"+SUMIFS('2 YO'!$E$2:$E$66,'2 YO'!$H$2:$H$66,\"Y\",'2 YO'!$I$2:$I$66,A7)","v":0},null,"Weekly Funded Hours",{"$f":"+IF(ISNA(VLOOKUP(A7,'EY PP'!$B$5:$F$73,4,FALSE)),0,VLOOKUP(A7,'EY PP'!$B$5:$F$73,4,FALSE))","v":0}]
["Funded Weeks",14,null,null,null,null,"Funded Weeks",14,null,"Funded Weeks",14]
[]
["Estimated Funded Hours",{"$f":"+IF(ISNA(VLOOKUP($A$7,'Adj Indicative'!A$1:O$82,12,FALSE)),0,VLOOKUP($A$7,'Adj Indicative'!A$1:O$82,12,FALSE))+IF(ISNA(VLOOKUP($A$7,'Adj Indicative'!A$1:O$82,13,FALSE)),0,VLOOKUP($A$7,'Adj Indicative'!A$1:O$82,13,FALSE))","v":0},null,"Number of children",0]
["Estimated Base Rate Funding",{"$f":"+B14*B11","v":0}]
["Estimated Deprivation Funding",{"$f":"+IF(ISNA(VLOOKUP($A$7,'Adj Indicative'!A$1:AK$82,36,FALSE)),0,VLOOKUP($A$7,'Adj Indicative'!A$1:AK$82,36,FALSE))","v":0}]
["Autumn Term Indicative Funding",{"$f":"B15+B16","v":0}]
[]
["Actual Funded Universal Hours",{"$f":"+IF(ISNA(VLOOKUP($A$7,'3&4'!$A$1:$G$74,5,FALSE)),0,VLOOKUP($A$7,'3&4'!$A$1:$G$74,5,FALSE))*14","v":0}]
["Actual Funded Extended Hours",{"$f":"+IF(ISNA(VLOOKUP($A$7,'3&4'!$A$1:$G$74,6,FALSE)),0,VLOOKUP($A$7,'3&4'!$A$1:$G$74,6,FALSE))*14","v":0}]
["Total Funded Hours",{"$f":"SUM(B19:B20)","v":0}]
[]
["Actual Base Rate Funding",{"$f":"B21*B11","v":0}]
["Actual Deprivation Funding",{"$f":"+IF(ISNA(VLOOKUP($A$7,'3&4'!$A$1:$J$74,10,FALSE)),0,VLOOKUP($A$7,'3&4'!$A$1:$J$74,10,FALSE))","v":0},null,null,null,null,"Hourly Rate",{"$f":"+'2 YO'!K1","v":5.03},null,"Hourly Rate",{"$f":"+'EY PP'!F2","v":0.53}]
["Autumn Final Funding",{"$f":"SUM(B23+B24)","v":0}]
[]
["Autumn Term Adjustment",{"$f":"B25-B17","v":0},null,null,{"$f":"E11*E14","v":0},null,"Autumn Term Funding",{"$f":"+H11*H12*H24","v":0},null,"Autumn Term Funding",{"$f":"+K11*K12*K24","v":0}]
[]
["1.  The 8 digit passcode was sent to all headteachers on 27th February 2017.  If you do not know your school passcode please email: School.funding@nottinghamcity.gov.uk"]
["2. Data has been taken from the October Census."]
{"$rows_left_out":10}
{"sheet":"DAf","index":1,"n_rows":0,"n_cols":0,"rows_kept":0,"cut":false,"hidden":true,"merged":[]}

{"sheet":"3&4","index":2,"n_rows":78,"n_cols":17,"rows_kept":78,"cut":false,"hidden":true,"merged":[]}
[null,null,null,"Weeks",12,12]
["Passcode","DFE","School Name","Status","October Census Weekly Hours (funded hours)","October Census Extended (with code)","October Census Weekly Hours (Hours at setting)","Hours not funded","Autumn Term Funded Hours","Deprivation","Base Rate","Autumn Term Funding","Estimated Autumn Term Funding","Variance actual v est","Maintained Schools Budget Share Adjustments","75% Academies Initial Spring payment based on indicitive","Academies Final Payment+ spring 75%"]
["2045jcKb",2045,"Bentinck Primary and Nursery School","Null",465,75,585,45,7560,1260,32130,33390,23100,10290,10290,"NA","NA"]
["2006MAGL",2006,"Berridge Primary","Null",840,0,840,0,11760,840,49980,50820,55650,-4830,-4830,"NA","NA"]
["2056bAuD",2056,"Cantrell Primary and Nursery School","Null",490,0,490,0,6860,560,29155,29715,32235,-2520,-2520,"NA","NA"]
["2057HOsi",2057,"Carrington Primary and Nursery School","Null",315,45,399,39,5040,210,21420,21630,15382.5,6247.5,6248,"NA","NA"]
["2894TISR",2894,"Claremont Primary and Nursery School","Null",315,0,315,0,4410,210,18742.5,18952.5,25357.5,-6405,-6405,"NA","NA"]
["2153nWDQ",2153,"Crab Tree Farm Primary","Null",570,0,570,0,7980,3360,33915,37275,50295,-13020,-13020,"NA","NA"]
["3323oqtU",3323,"Dovecote Primary and Nursery School","Null",570,75,645,0,9030,1260,38377.5,39637.5,52027.5,-12390,-12390,"NA","NA"]
["2061xJcy",2061,"Dunkirk Primary and Nursery School","Null",240,0,240,0,3360,420,14280,14700,29400,-14700,-14700,"NA","NA"]
["2016jnOu",2016,"Fernwood Primary (was Infants)","Null",870,345,1215,0,17010,1260,72292.5,73552.5,93870,-20317.5,-20318,"NA","NA"]
["2929hDZn",2929,"Forest Fields Primary and Nursery School","Null",615,15,630,0,8820,1470,37485,38955,46305,-7350,-7350,"NA","NA"]
["2360ioBv",2360,"Glade Hill Primary School","Null",465,75,560,20,7560,1680,32130,33810,32235,1575,1575,"NA","NA"]
["3324xTCS",3324,"Greenfields Community School","Null",270,45,540,225,4410,1680,18742.5,20422.5,21105,-682.5,-683,"NA","NA"]
["2163KqTk",2163,"Haydn Primary School","Null",780,210,990,0,13860,1470,58905,60375,41002.5,19372.5,19373,"NA","NA"]
["2095dtuN",2095,"Heathfield Primary and Nursery School","Null",825,150,975,0,13650,5250,58012.5,63262.5,48930,14332.5,14333,"NA","NA"]
["2170MqVW",2170,"Hempshill Hall Primary School","Null",495,0,495,0,6930,420,29452.5,29872.5,45622.5,-15750,-15750,"NA","NA"]
["3328RPTm",3328,"Henry Whipple Primary School","Null",255,75,510,180,4620,1470,19635,21105,17535,3570,3570,"NA","NA"]
["2079FvIw",2079,"Melbury Primary School","Null",225,0,225,0,3150,1050,13387.5,14437.5,26880,-12442.5,-12443,"NA","NA"]
["2158hMrS",2158,"Mellers Primary and Nursery School","Null",600,15,990,375,8610,2730,36592.5,39322.5,59903,-20580.5,-20581,"NA","NA"]
["2080tRdj",2080,"Middleton Primary and Nursery School","Null",720,0,720,0,10080,0,42840,42840,81847.5,-39007.5,-39008,"NA","NA"]
["7042NwsN",7042,"Oak Field School","Null",45,0,60,15,630,0,0,0,0,0,0,"NA","NA"]
["2151vOUw",2151,"Rise Park Primary and Nursery School","Null",585,240,870,45,11550,1050,49087.5,50137.5,50977.5,-840,-840,"NA","NA"]
["3329RIdN",3329,"Robin Hood Primary School","Null",900,165,1065,0,14910,630,63367.5,63997.5,48037.5,15960,15960,"NA","NA"]
["3332hTln",3332,"Rufford Primary School","Null",525,0,525,0,7350,2310,31237.5,33547.5,26617.5,6930,6930,"NA","NA"]
["2007acGn",2007,"Seely Primary","Null",510,0,520,10,7140,840,30345,31185,44467.5,-13282.5,-13283,"NA","NA"]
["2897xXHv",2897,"Snape Wood Primary and Nursery School","Null",315,0,315,0,4410,1680,18742.5,20422.5,35490,-15067.5,-15068,"NA","NA"]
["3326cFKo",3326,"Southglade Primary School","Null",630,60,1230,540,9660,2520,41055,43575,44205,-630,-630,"NA","NA"]
["2128wfAl",2128,"Southwold Primary School and Early Years' Centre","Null",315,15,450,120,4620,1680,19635,21315,26460,-5145,-5145,"NA","NA"]
["1012KMdb",1012,"The Nottingham Nursery School","Null",765,75,840,0,11760,1680,49980,51660,48510,3150,3150,"NA","NA"]
{"$rows_left_out":49}
{"sheet":"Adj Indicative","index":3,"n_rows":82,"n_cols":47,"rows_kept":82,"cut":false,"hidden":true,"merged":[[3,15,3,16],[3,17,3,18],[3,19,3,20],[3,21,3,22],[3,3,3,4],[3,5,3,6],[3,7,3,8],[3,9,3,10],[3,11,3,12],[3,13,3,14],[2,3,2,8],[2,9,2,14],[2,15,2,20],[2,28,2,32],[2,33,2,37],[2,38,2,42]]}
[null,null,null,"Indicative EY Base rate funding 2017/18",null,null,null,null,null,null,null,null,null,null,null,null,null,null,null,null,null,null,null,null,null,null,null,null,"Indicative EY Deprivation Funding 2017/18"]
[]
[null,null,null,"SUMMER TERM 2016",null,null,null,null,null,"AUTUMN TERM 2016",null,null,null,null,null,"SPRING TERM 2016",null,null,null,null,null,null,null,null,null,null,null,null,"SUMMER TERM",null,null,null,null,"AUTUMN TERM",null,null,null,null,"SPRING TERM"]
[null,null,null,"Number of Children Accessing",null,"Total Funded hours",null,"Indicative Base rate funding",null,"Number of Children Accessing",null,"Total Funded hours",null,"Indicative Base rate funding",null,"Number of Children Accessing",null,"Total Funded hours",null,"Indicative Base rate funding",null,"Total Indicative 2017/18 Base rate funding",null,null,null,null,45,null,"Estimate eligible EYPP children accessing",null,"Deprivation funding",null,null,"Estimate eligible EYPP children accessing",null,"Deprivation Funding",null,null,"Estimate eligible EYPP children accessing",null,"Deprivation Funding",null,null,"Total Indicative 2017/18 Deprivation funding"]
["Passcode","DfE","School","Universal 15 hour entitlement","Local additional hours","Universal 15 hour entitlement","Local additional hours","Universal 15 hour entitlement","Local additional hours","Universal 15 hour entitlement","National additional entitlement for working parents","Universal 15 hour entitlement","National additional entitlement for working parents","Universal 15 hour entitlement","National additional entitlement for working parents","Universal 15 hour entitlement","National additional entitlement for working parents","Universal 15 hour entitlement","National additional entitlement for working parents","Universal 15 hour entitlement","National additional entitlement for working parents","Universal 15 hour entitlement","Additional hours",null,"Passcode","DfE","School","Assumed % pupils eligible for EYPP","Universal 15 hour entitlement only","Local additional hours","Universal 15 hour entitlement hours","Local additional hours","EYPP","Universal 15 hour entitlement","National additional entitlement for working parents","Universal 15 hour entitlement hours","National additional entitlement hours for working parents","EYPP","Universal 15 hour entitlement","National additional entitlement for working parents","Universal 15 hour entitlement hours","National additional entitlement hours for working parents","EYPP","Universal 15 hour entitlement hours","Additional hours","EYPP"]
["2002riNz",2002,"AMBLESIDE PRIMARY SCHOOL",141,0,25380,0,107865,0,82,null,17220,0,73185,0,120,null,21600,0,91800,0,272850,0,null,"2002riNz",2002,"AMBLESIDE PRIMARY SCHOOL",0.321656050955414,45,0,8100,0,4293,26,0,5460,0,2893.8,39,0,7020,0,3720.6000000000004,20580,0,10907.400000000001,{"$f":"B6-Z6","v":0}]
["2045jcKb",2045,"Bentinck Primary School",34,17,6120,2040,26010,8670,24,null,5040,0,21420,0,34,null,6120,0,26010,0,73440,8670,null,"2045jcKb",2045,"Bentinck Primary School",0.34466019417475702,12,6,2160,720,1144.8,8,0,1680,0,890.40000000000009,12,0,2160,0,1144.8,6000,720,3180,{"$f":"B7-Z7","v":0}]
["2006MAGL",2006,"Berridge Primary School",111,0,19980,0,84915,0,60,null,12600,0,53550,0,87,null,15660,0,66555,0,205020,0,null,"2006MAGL",2006,"Berridge Primary School",0.16260162601625999,18,0,3240,0,1717.2,10,0,2100,0,1113,14,0,2520,0,1335.6000000000001,7860,0,4165.8,0]
["3319QBOK",3319,"Blessed Robert Widmerpool Catholic Voluntary Academy",59,0,10620,0,45135,0,42,null,8820,0,37485,0,51,null,9180,0,39015,0,121635,0,null,"3319QBOK",3319,"Blessed Robert Widmerpool Catholic Voluntary Academy",4.1095890410958902E-2,2,0,360,0,190.8,2,0,420,0,222.60000000000002,2,0,360,0,190.8,1140,0,604.20000000000005,0]
["2183JqYY",2183,"BLUE BELL HILL PRIMARY SCHOOL",66,0,11880,0,50490,0,55,null,11550,0,49087.5,0,59,null,10620,0,45135,0,144712.5,0,null,"2183JqYY",2183,"BLUE BELL HILL PRIMARY SCHOOL",0.30272952853598001,20,0,3600,0,1908,17,0,3570,0,1892.1000000000001,18,0,3240,0,1717.2,10410,0,5517.3,0]
["4615dHTk",4615,"BLUECOAT ACADEMY",0,0,0,0,0,0,26,null,5460,0,23205,0,26,null,4680,0,19890,0,43095,0,null,"4615dHTk",4615,"BLUECOAT ACADEMY",0.182352941176471,0,0,0,0,0,5,0,1050,0,556.5,5,0,900,0,477,1950,0,1033.5,0]
["2014sKZl",2014,"Brocklewood Primary School",79,0,14220,0,60435,0,46,null,9660,0,41055,0,61,null,10980,0,46665,0,148155,0,null,"2014sKZl",2014,"Brocklewood Primary School",0.44088176352705399,35,0,6300,0,3339,20,0,4200,0,2226,27,0,4860,0,2575.8000000000002,15360,0,8140.8,0]
["3000JAIt",3000,"BULWELL ST. MARYS C. OF E.",36,12,5940,1440,25245,6120,27,null,5670,0,24097.5,0,33,null,5940,0,25245,0,74587.5,6120,null,"3000JAIt",3000,"BULWELL ST. MARYS C. OF E.",0.30584192439862501,11,4,1980,480,1049.4000000000001,8,0,1680,0,890.40000000000009,10,0,1800,0,954,5460,480,2893.8,0]
["2082fWlx",2082,"BURFORD PRIMARY & NURSERY",48,0,8640,0,36720,0,22,null,4620,0,19635,0,38,null,6840,0,29070,0,85425,0,null,"2082fWlx",2082,"BURFORD PRIMARY & NURSERY",0.29951690821256,14,0,2520,0,1335.6000000000001,7,0,1470,0,779.1,11,0,1980,0,1049.4000000000001,5970,0,3164.1000000000004,0]
["2056bAuD",2056,"Cantrell Primary & Nurs",70,0,11460,0,48705,0,34,null,7140,0,30345,0,64,null,11520,0,48960,0,128010,0,null,"2056bAuD",2056,"Cantrell Primary & Nurs",0.26491646778042999,19,0,3420,0,1812.6000000000001,9,0,1890,0,1001.7,17,0,3060,0,1621.8000000000002,8370,0,4436.1000000000004,0]
["2057HOsi",2057,"Carrington Pri & Nurs",31,17,5580,1980,23715,8415,17,null,3570,0,15172.5,0,28,null,5040,0,21420,0,60307.5,8415,null,"2057HOsi",2057,"Carrington Pri & Nurs",7.7669902912621394E-2,2,1,360,120,190.8,1,0,210,0,111.30000000000001,2,0,360,0,190.8,930,120,492.90000000000003,0]
["2894TISR",2894,"Claremont Primary School",39,26,6630,3120,28177.5,13260,27,null,5670,0,24097.5,0,31,null,5580,0,23715,0,75990,13260,null,"2894TISR",2894,"Claremont Primary School",0.206632653061224,8,5,1440,600,763.2,6,0,1260,0,667.80000000000007,6,0,1080,0,572.4,3780,600,2003.4,0]
["2153nWDQ",2153,"Crabtree Farm Primary",73,0,13140,0,55845,0,50,null,10500,0,44625,0,61,null,10980,0,46665,0,147135,0,null,"2153nWDQ",2153,"Crabtree Farm Primary",0.53865336658354102,39,0,7020,0,3720.6000000000004,27,0,5670,0,3005.1000000000004,33,0,5940,0,3148.2000000000003,18630,0,9873.9000000000015,0]
["2081LkKD",2081,"Djanogly Northgate Academy",71,0,12780,0,54315,0,51,null,10710,0,45517.5,0,54,null,9720,0,41310,0,141142.5,0,null,"2081LkKD",2081,"Djanogly Northgate Academy",0.25441696113074203,18,0,3240,0,1717.2,13,0,2730,0,1446.9,14,0,2520,0,1335.6000000000001,8490,0,4499.7000000000007,0]
["2011poYO",2011,"Djanogly Strelley Academy",60,0,10800,0,45900,0,37,null,7770,0,33022.5,0,50,null,9000,0,38250,0,117172.5,0,null,"2011poYO",2011,"Djanogly Strelley Academy",0.44358974358974401,27,0,4860,0,2575.8000000000002,16,0,3360,0,1780.8000000000002,22,0,3960,0,2098.8000000000002,12180,0,6455.4000000000005,0]
["3323oqtU",3323,"Dovecote Primary",79,0,13620,0,57885,0,55,null,11550,0,49087.5,0,52,null,9360,0,39780,0,146752.5,0,null,"3323oqtU",3323,"Dovecote Primary",0.24937027707808601,20,0,3600,0,1908,14,0,2940,0,1558.2,13,0,2340,0,1240.2,8880,0,4706.3999999999996,0]
["2061xJcy",2061,"Dunkirk Primary School",40,14,7200,1680,30600,7140,32,null,6720,0,28560,0,33,null,5940,0,25245,0,84405,7140,null,"2061xJcy",2061,"Dunkirk Primary School",0.12254901960784299,5,2,900,240,477,4,0,840,0,445.20000000000005,4,0,720,0,381.6,2460,240,1303.8000000000002,0]
["2099WTff",2099,"Edale Rise Primary and Nursery",48,0,8640,0,36720,0,35,null,7350,0,31237.5,0,43,null,7740,0,32895,0,100852.5,0,null,"2099WTff",2099,"Edale Rise Primary and Nursery",0.28431372549019601,14,0,2520,0,1335.6000000000001,10,0,2100,0,1113,12,0,2160,0,1144.8,6780,0,3593.4000000000005,0]
["2074hvrt",2074,"Edna G Olds Academy",47,20,8460,2400,35955,10200,30,null,6300,0,26775,0,39,null,7020,0,29835,0,92565,10200,null,"2074hvrt",2074,"Edna G Olds Academy",0.27500000000000002,13,6,2340,720,1240.2,8,0,1680,0,890.40000000000009,11,0,1980,0,1049.4000000000001,6000,720,3180.0000000000005,0]
["2016jnOu",2016,"Fernwood Primary School",104,0,18720,0,79560,0,104,null,21840,0,92820,0,104,null,18720,0,79560,0,251940,0,null,"2016jnOu",2016,"Fernwood Primary School",4.8206278026905802E-2,5,0,900,0,477,5,0,1050,0,556.5,5,0,900,0,477,2850,0,1510.5,0]
["2005HQuH",2005,"Firbeck Academy",37,23,6624,1956,28152,8313,35,null,7350,0,31237.5,0,31,null,5580,0,23715,0,83104.5,8313,null,"2005HQuH",2005,"Firbeck Academy",0.25123152709359597,9,6,1620,720,858.6,9,0,1890,0,1001.7,8,0,1440,0,763.2,4950,720,2623.5,0]
["2929hDZn",2929,"Forest Fields Primary School",58,46,10080,5520,42840,23460,50,null,10500,0,44625,0,45,null,8100,0,34425,0,121890,23460,null,"2929hDZn",2929,"Forest Fields Primary School",0.16945996275605199,10,8,1800,960,954,8,0,1680,0,890.40000000000009,8,0,1440,0,763.2,4920,960,2607.6000000000004,0]
["2360ioBv",2360,"Glade Hill Primary School",52,32,9360,2352,39780,9996,34,null,7140,0,30345,0,36,null,6480,0,27540,0,97665,9996,null,"2360ioBv",2360,"Glade Hill Primary School",0.25,13,8,2340,960,1240.2,9,0,1890,0,1001.7,9,0,1620,0,858.6,5850,960,3100.5,0]
["2009jKrj",2009,"Glenbrook Primary",26,18,4680,2160,19890,9180,19,null,3990,0,16957.5,0,25,null,4500,0,19125,0,55972.5,9180,null,"2009jKrj",2009,"Glenbrook Primary",0.41666666666666702,11,8,1980,960,1049.4000000000001,8,0,1680,0,890.40000000000009,10,0,1800,0,954,5460,960,2893.8,0]
["3324xTCS",3324,"Greenfields Community Primary",41,0,7380,0,31365,0,22,null,4620,0,19635,0,36,null,6480,0,27540,0,78540,0,null,"3324xTCS",3324,"Greenfields Community Primary",0.32673267326732702,13,0,2340,0,1240.2,7,0,1470,0,779.1,12,0,2160,0,1144.8,5970,0,3164.1000000000004,0]
{"$rows_left_out":53}
{"sheet":"2 YO","index":4,"n_rows":66,"n_cols":11,"rows_kept":66,"cut":false,"hidden":true,"merged":[]}
["FORENAME","SURNAME","DOB","ONE LINE ADDRESS","ACT HRS WK","PROV NAME","SCHOOL DfE No.:","ELIGIBLE RISING 3'S ","Passcode","Summer term funding",5.03]
["Leo","Lander","2014-09-11",null,15,"Crabtree Farm Primary and Nursery School","2153","Y","2153nWDQ",1056.3]
["Ebony-Rose","Johnson","2014-09-25",null,15,"Crabtree Farm Primary and Nursery School","2153","Y","2153nWDQ",1056.3]
["Renezmai","Richardson","2014-09-30",null,15,"Crabtree Farm Primary and Nursery School","2153","Y","2153nWDQ",1056.3]
["Danial","Malik","2014-10-05",null,15,"Forest Fields Primary School","2929","Y","2929hDZn",1056.3]
["Joel","Booth-Hayes","2014-09-29",null,15,"Forest Fields Primary School","2929","Y","2929hDZn",1056.3]
["Muhammad","Arslan","2014-09-10",null,15,"Forest Fields Primary School","2929","Y","2929hDZn",1056.3]
["Lola","Devlin","2014-09-05",null,15,"Glade Hill Primary School","2360","Y","2360ioBv",1056.3]
["Alwand","Ahmmad","2014-09-16",null,15,"Greenfields Community Primary","3324","Y","3324xTCS",1056.3]
["Summer-Jo","Wixon","2014-09-24",null,15,"Greenfields Community Primary","3324","Y","3324xTCS",1056.3]
["Soinaz","Babaker","2014-09-28",null,15,"Greenfields Community Primary","3324","Y","3324xTCS",1056.3]
["Delaney","Higgins","2014-09-15",null,15,"Hempshill Hall Primary School","2170","Y","2170MqVW",1056.3]
["Myli","Howarth","2014-09-23",null,15,"Hempshill Hall Primary School","2170","Y","2170MqVW",1056.3]
["Poppie","Edwards","2014-09-12",null,15,"Henry Whipple Primary School","3328","Y","3328RPTm",1056.3]
["Cole","Brown","2014-09-20",null,15,"Henry Whipple Primary School","3328","Y","3328RPTm",1056.3]
["Leo","Mattimore","2014-09-15",null,15,"Robin Hood Primary School","3329","Y","3329RIdN",1056.3]
["Olivia","Kingston","2014-09-14",null,15,"Seely Primary School","2007","Y","2007acGn",1056.3]
["Adam","Eissa","2014-09-21",null,15,"SOUTHWOLD PRIMARY","2128","Y","2128wfAl",1056.3]
["Alieu","Nyandou","2014-09-16",null,15,"The Nottingham Nursery School and Training Centre","1012","Y","1012KMdb",1056.3]
["Hannah","Sierzpowska","2014-09-23",null,15,"The Nottingham Nursery School and Training Centre","1012","Y","1012KMdb",1056.3]
["Hibba","Irfan","2014-10-08",null,15,"The Nottingham Nursery School and Training Centre","1012","Y","1012KMdb",1056.3]
["Hanna","Manowiecka","2014-10-11",null,15,"The Nottingham Nursery School and Training Centre","1012","Y","1012KMdb",1056.3]
["Lawe","Kader","2014-10-15",null,15,"The Nottingham Nursery School and Training Centre","1012","Y","1012KMdb",1056.3]
["Elaf","Ali","2014-11-02",null,15,"The Nottingham Nursery School and Training Centre","1012","Y","1012KMdb",1056.3]
["Brayden","McDevitt","2014-11-06",null,15,"The Nottingham Nursery School and Training Centre","1012","Y","1012KMdb",1056.3]
["Layth","Albana","2014-11-14",null,15,"The Nottingham Nursery School and Training Centre","1012","Y","1012KMdb",1056.3]
["Ridwan","Ishag","2014-11-15",null,15,"The Nottingham Nursery School and Training Centre","1012","Y","1012KMdb",1056.3]
["Moayad","Sharif","2014-11-17",null,15,"The Nottingham Nursery School and Training Centre","1012","Y","1012KMdb",1056.3]
["Alexandra","Lubaki","2014-11-20",null,15,"The Nottingham Nursery School and Training Centre","1012","Y","1012KMdb",1056.3]
["Natalia","Borek","2014-11-30",null,15,"The Nottingham Nursery School and Training Centre","1012","Y","1012KMdb",1056.3]
{"$rows_left_out":37}
{"sheet":"EY PP","index":5,"n_rows":80,"n_cols":6,"rows_kept":80,"cut":false,"hidden":true,"merged":[]}
["EY PP Autumn Term",null,null,"EY PP Autumn Term"]
[null,null,null,null,"Rate",0.53]
[null,null,null,null,"Weeks",14]
["Acad/Main","Passcode","NativeID","SchoolName","Eligible Hours","Funding"]
["M","2045jcKb",8922045,"Bentinck Primary School",90,668]
["M","2006MAGL",8922006,"Berridge Primary School",60,445]
["M","2056bAuD",8922056,"CANTRELL PRIMARY",40,297]
["M","2057HOsi",8922057,"CARRINGTON PRIMARY SCHOOL",15,111]
["M","2894TISR",8922894,"Claremont Primary School",15,111]
["M","2153nWDQ",8922153,"Crabtree Farm Primary and Nursery School",240,1781]
["M","3323oqtU",8923323,"Dovecote Primary",90,668]
["M","2061xJcy",8922061,"Dunkirk Primary School",30,223]
["M","2016jnOu",8922016,"Fernwood Primary School",75,557]
["M","2929hDZn",8922929,"Forest Fields Primary School",105,779]
["M","2360ioBv",8922360,"Glade Hill Primary School",120,890]
["M","3324xTCS",8923324,"Greenfields Community Primary",120,890]
["M","2163KqTk",8922163,"Haydn Primary School",90,668]
["M","2095dtuN",8922095,"HEATHFIELD PRIMARY & NURSERY SCHOOL",360,2671]
["M","2170MqVW",8922170,"Hempshill Hall Primary School",30,223]
["M","3328RPTm",8923328,"Henry Whipple Primary School",105,779]
["M","2079FvIw",8922079,"MELBURY PRIMARY SCHOOL",75,557]
["M","2158hMrS",8922158,"Mellers Primary and Nursery",195,1447]
["M","2080tRdj",8922080,"Middleton Primary School",0,0]
["M","7042NwsN",8927042,"Oak Field School and Specialist Sports College",15,111]
["M","2151vOUw",8922151,"RISE PARK PRIMARY SCHOOL",75,557]
["M","3329RIdN",8923329,"Robin Hood Primary School",45,334]
["M","3332hTln",8923332,"Rufford Primary and Nursery",165,1224]
["M","2007acGn",8922007,"Seely Primary School",60,445]
["M","2897xXHv",8922897,"Snape Wood Primary School",120,890]
["M","3326cFKo",8923326,"Southglade Primary School",180,1336]
{"$rows_left_out":51}
{"sheet":"EYPP Pupils","index":6,"n_rows":483,"n_cols":8,"rows_kept":483,"cut":false,"hidden":false,"merged":[]}
[]
[null,{"$f":"+IF('Early Years Funding'!A7=\"\",\"\",LEFT('Early Years Funding'!A7,4))","v":""},{"$f":"+'Early Years Funding'!B7","v":"Please enter your 8 digit passcode in the blue box"},{"$f":"+'Early Years Funding'!A7","v":0}]
[]
["Passcode","DFE","SCHOOL","NAME","DOB","HOURS/WEEK","AUTUMN TERM HOURS","Autumn Term EYPP"]
["2002riNz",2002,"AMBLESIDE PRIMARY SCHOOL","Alyscia Metcalfe","2014-06-28",15,210,111.30000000000001]
["2002riNz",2002,"AMBLESIDE PRIMARY SCHOOL","Amelieanna Taylor","2014-04-02",15,210,111.30000000000001]
["2002riNz",2002,"AMBLESIDE PRIMARY SCHOOL","Amie-Leigh Bentley","2014-02-08",15,210,111.30000000000001]
["2002riNz",2002,"AMBLESIDE PRIMARY SCHOOL","Arianna Vaughan","2013-11-01",15,210,111.30000000000001]
["2002riNz",2002,"AMBLESIDE PRIMARY SCHOOL","Brody Carter","2014-05-10",15,210,111.30000000000001]
["2002riNz",2002,"AMBLESIDE PRIMARY SCHOOL","Casen Ricketts","2013-10-24",15,210,111.30000000000001]
["2002riNz",2002,"AMBLESIDE PRIMARY SCHOOL","Chyann Upton","2014-08-23",15,210,111.30000000000001]
["2002riNz",2002,"AMBLESIDE PRIMARY SCHOOL","Destiny Shaw","2014-05-08",15,210,111.30000000000001]
["2002riNz",2002,"AMBLESIDE PRIMARY SCHOOL","Ellie-Mae Carter","2013-10-02",15,210,111.30000000000001]
["2002riNz",2002,"AMBLESIDE PRIMARY SCHOOL","Eva Nigussie","2014-05-21",15,210,111.30000000000001]
["2002riNz",2002,"AMBLESIDE PRIMARY SCHOOL","Frayah Betton","2014-06-23",15,210,111.30000000000001]
["2002riNz",2002,"AMBLESIDE PRIMARY SCHOOL","Harlie Hepburn","2014-02-02",15,210,111.30000000000001]
["2002riNz",2002,"AMBLESIDE PRIMARY SCHOOL","Irmina Olejarz","2014-01-22",15,210,111.30000000000001]
["2002riNz",2002,"AMBLESIDE PRIMARY SCHOOL","Isaac Anderson","2013-10-05",15,210,111.30000000000001]
["2002riNz",2002,"AMBLESIDE PRIMARY SCHOOL","Jack Greaves","2014-03-03",15,210,111.30000000000001]
["2002riNz",2002,"AMBLESIDE PRIMARY SCHOOL","Jamal Aziz","2014-06-24",15,210,111.30000000000001]
["2002riNz",2002,"AMBLESIDE PRIMARY SCHOOL","Jenson Ward-Bilson","2013-10-28",15,210,111.30000000000001]
["2002riNz",2002,"AMBLESIDE PRIMARY SCHOOL","Karlel Shelton-Osbourne","2014-02-06",15,210,111.30000000000001]
["2002riNz",2002,"AMBLESIDE PRIMARY SCHOOL","Kaziar Daley","2013-10-03",15,210,111.30000000000001]
["2002riNz",2002,"AMBLESIDE PRIMARY SCHOOL","Kennen Wilson","2014-08-05",15,210,111.30000000000001]
["2002riNz",2002,"AMBLESIDE PRIMARY SCHOOL","Lexi-Mae Street-Dawson","2014-02-11",15,210,111.30000000000001]
["2002riNz",2002,"AMBLESIDE PRIMARY SCHOOL","Lydia-Mae Wilde","2014-02-06",15,210,111.30000000000001]
["2002riNz",2002,"AMBLESIDE PRIMARY SCHOOL","Malaika Khan","2014-01-05",15,210,111.30000000000001]
["2002riNz",2002,"AMBLESIDE PRIMARY SCHOOL","Mia Oakley","2014-03-21",15,210,111.30000000000001]
["2002riNz",2002,"AMBLESIDE PRIMARY SCHOOL","Michael Wilga","2014-06-28",15,210,111.30000000000001]
["2002riNz",2002,"AMBLESIDE PRIMARY SCHOOL","Mohammed Ali","2014-01-19",15,210,111.30000000000001]
{"$rows_left_out":453}